{"text_format":"1","workbook":"xlsx","n_sheets":25,"sheets":["Manual","Novinky","Splatka","adminSplatka","Bonita","adminBonita","Nabidka","Kalendar","adminKalendar","Zadost","Dokumenty","Doplneni","PrazdnaZadost","FIN_CLC","Domain","ALM_Hypo","Defsazby","DefProd","DefSpecPar","POBOČKY ","Nemovitost","adminNemoviost","Protokol","DP","Old_New"],"not_rendered":{"charts":0,"images":3,"macros":1,"external_links":0,"defined_names":1129,"comments":4,"pivot_tables":0},"unopened":[],"bounds":{"document_bytes":16777216,"sheet_cells":100000,"rows_first":2000,"rows_last":500,"rows_between":2000,"halvings":0,"cell_chars":16384,"cell_head_chars":4096},"cells_cut":0,"cells_raw":0,"read":"whole","date_system":"1900"}

{"sheet":"Manual","index":0,"n_rows":49,"n_cols":23,"rows_kept":49,"cut":false,"hidden":false,"merged":[[20,3,20,6],[2,1,2,4],[7,3,7,6],[7,14,7,21],[10,3,10,6],[10,14,10,21]]}
[]
[]
[null,"MANUÁL",null,null,null,null,null,null,null,null,null,null,null,null,null,null,null,null,null,null,null,null,{"$f":"novVerze","v":"v.14a"}]
[]
[null,"Postup pobočky:",null,null,null,null,null,null,null,null,null,null,"Postup 3P:"]
[]
[null,null,"1) Vyplnění údajů v kartách \"Splátka\" a \"Bonita\"",null,null,null,null,null,null,null,null,null,null,"1) Vyplnění údajů v kartách \"Splátka\" a \"Bonita\""]
[null,null,null,"povinné před odesláním na KC",null,null,null,null,null,null,null,null,null,null,"nutné před odesláním žádosti o prověření registrů na pobočku Banky"]
[]
[null,null,"2) Vyplnění žádosti a doplňujících údajů s klientem",null,null,null,null,null,null,null,null,null,null,"2) Vyplnění žádosti s klientem"]
[null,null,null,"není povinné před odesláním na KC",null,null,null,null,null,null,null,null,null,null,"nutné před odesláním žádosti o prověření registrů na pobočku Banky"]
[]
[null,null,null,"Kdy použít?\n",null,null,null,null,null,null,null,null,null,"3) Vyplnění Doplnění žádosti s klientem"]
[null,null,null,null,"v případě, že nefunguje tisk z Expert Tool",null,null,null,null,null,null,null,null,null,"není nutné před odesláním žádosti o prověření registrů na pobočku Banky"]
[null,null,null,null,"v případě, že s klientem vyplňujete žádost na pobočce",null,null,null,null,null,null,null,null,"4) Odeslání celé kalkulačky ve formátu .xls na pobočku Banky"]
[null,null,null,"K čemu slouží?",null,null,null,null,null,null,null,null,null,null,"není nutné před odesláním žádosti o prověření registrů na pobočku Banky"]
[null,null,null,null,"urychlí a zefektivní kontroly na Kreditním centru"]
[null,null,null,"Žádost je možné vytisknout i jako prázdný formulář, který můžete vyplnit ručně :-)"]
[]
[null,null,"3) Uložení celé kalkulačky ve formátu .xls do DMS"]
[null,null,null,"povinné před odesláním na KC"]
[]
[]
[null,"Přehled funkcionalit nástroje:"]
[]
[null,null,"Pás tlačítek"]
[null,null,null,"Nově není potřeba \"hledat\" názvy listů v sešitu, ale navigace je pohodlná přes pás tlačítek viditelně umístěný u horního okraje aplikace :-)"]
[]
[null,null,"Modelování nabídky - karta \"Splátka\""]
[null,null,null,"Nově se zadává datum narození klienta a délka čerpání - kalkulačka sama hlídá překročení věkové hranice při splatnosti a nutnost pojištění z důvodu věku klienta :-)"]
[]
[null,null,"Výpočet Bonity - karta \"Bonita\""]
[null,null,null,"Nově lze zobrazit pouze relevantní druhy příjmů u žadatele i spolužadatele - kalkulačka je přehledná a nezobrazuje nepotřebné údaje :-)"]
[null,null,null,"Snadné přepínání mezi režimem více domácností :-)"]
[null,null,null,"Bonita nyní ukazuje kromě Debt Ratio i maximální možný limit dle zadaných parametrů :-)"]
[null,null,null,"Lze zadat i souběh příjmů u kteréhokoliv ze spolužadatelů :-) Nezapomínejte však, že mimo příjem z pronájmu je jakýkoliv jiný souběh nutné předem konzultovat se schvalovateli!"]
[]
[null,null,"Nabídka"]
[null,null,null,"Nová personalizovaná nabídka pro klienta v designu UCB a s možností dopsat libovolné kontakty na poradce :-)"]
[]
[null,null,"Žádost"]
[null,null,null,"Nově lze vyplnit žádost přímo v Kalkulačce i pro více spolužadatelů zároveň :-)"]
[null,null,null,"Žádost již není rozdělena do více listů - snadný tisk :-)"]
[null,null,null,"Opakující se pole v různých částech formuláře se propisují dále - usnadnění vyplňování :-)"]
[]
[null,null,"Doplnění žádosti"]
[null,null,null,"Nově lze vyplnit Doplnění žádosti přímo v Kalkulačce i pro více spolužadatelů zároveň :-)"]
[null,null,null,"Doplnění žádosti již není rozděleno do více listů - snadný tisk :-)"]
[null,null,null,"Opakující se pole v zůzných částech formuláře se propisují dále - usnadnění vyplňování :-)"]

{"sheet":"Novinky","index":1,"n_rows":21,"n_cols":5,"rows_kept":21,"cut":false,"hidden":false,"merged":[[2,1,2,2],[20,1,20,3]]}
[]
[]
[null,"NOVINKY",null,null,"v.14a"]
[]
[null,"Datum aktualizace","Verze","Popis novinky"]
[null,"2015-11-01","14a","o Změna slevy za CPI na 30 bps.\no Pásmové úročení - zdražení úvěrů do 999.999,- Kč\no Pravidelná aktualizace úrokových sazeb."]
[null,"2015-10-01","13f","o Nabídka - přidání volby poplatku za zpracování 2 500/0,-.\no Pravidelná aktualizace úrokových sazeb."]
[null,"2015-09-01","13d","o Pravidelná aktualizace úrokových sazeb."]
[null,"2015-07-31","13c","o zrušení nabídky sazby Float s garancí.\no Pravidelná aktualizace úrokových sazeb."]
[null,"2015-07-17","13b"]
[null,"2015-07-09","13a"]
[null,"2015-07-01",13,"o Generátor dokumentů.\no Pravidelná aktualizace úrokových sazeb."]
[null,"2015-06-01","12c","o Zrušení typu produktu Flexi a vznik nové služby Mimořádná splátka až 100% jistiny.\no Pravidelná aktualizace úrokových sazeb."]
[null,"2015-05-22","12b"]
[null,"2015-05-20","12a"]
[null,"2015-05-18",12,"Celková aktualizace Hypokalkulačky která Vám přináší nové funkčnosti:\n     o Nový výpočet příjmu podle aktualizované metodiky.\n     o Výpočet maximální možné výše úvěru podle bonity klienta.\n     o Nový tiskový výstup nabídky.\n     o Možnost tisku žádosti přímo z kalkulačky. Údaje vyplněné při modelaci úvěru se Vám automaticky předvyplní. \n     o Kontrola věku v době splatnosti úvěru (z toho důvodu přibylo pole doba čerpání úvěru a datum narození).\nVíce informací naleznete v Manuálu."]
[]
[]
[null,"PŘIPRAVUJEME"]
[]
[null,"Mezi připravované novinky, o které chceme nástroj v nejbližší době rozšířit patří:\n     o Větší provázanost jednotlivých záložek."]

{"sheet":"Splatka","index":2,"n_rows":129,"n_cols":18,"rows_kept":129,"cut":false,"hidden":false,"merged":[[67,2,67,15],[46,5,46,7],[46,14,46,15],[65,3,65,4],[65,12,65,13],[57,6,57,7],[59,6,59,7],[42,5,42,7],[44,5,44,7],[42,14,42,15],[21,13,21,15],[23,13,23,15],[28,13,28,15],[37,5,37,7],[44,14,44,15],[2,0,2,4],[4,4,4,7],[4,13,4,15],[17,1,17,2],[19,13,19,15],[11,13,11,15],[15,14,15,15],[7,12,7,15],[7,3,7,7],[91,14,91,15],[92,5,92,7],[92,14,92,15],[70,5,70,7],[71,5,71,7],[72,5,72,7],[73,5,73,7],[80,11,84,15],[74,5,74,7],[80,5,80,7],[84,5,84,7],[85,5,85,7],[86,5,86,7],[75,5,75,7],[82,5,82,7],[70,11,74,15],[83,5,83,7],[81,5,81,7],[87,5,87,7],[97,5,97,7],[93,5,93,7],[94,5,94,7],[95,5,95,7],[96,5,96,7],[91,5,91,7]]}
[]
[null,null,null,null,null,null,null,null,null,null,null,null,null,null,null,null,null,"3P"]
["SPLÁTKA",null,null,null,null,null,null,null,null,null,null,null,null,null,null,null,null,{"$f":"manVerze","v":"v.14a"}]
[]
[null,null,"Jméno klienta",null,"",null,null,null,null,null,null,"Příjmení klienta"]
[]
[]
[null,null,"Typ hypotéky","Hypoteční úvěr účelový rezidenční Individual",null,null,null,null,null,"Účel hypotéky"]
[]
[]
[]
[null,null,"Klient žádal 30 dní od data podpisu žádosti o PRESTO / PRESTO NPR"]
[]
[null,"Pomocník při výpočtu splatnosti"]
[]
[null,null,"Předpoklad podpisu smlouvy do (počet měsíců)",null,null,null,null,3,null,null,null,"CL&C datum splatnosti",null,null,{"$f":"FinKonecUveru","v":"2016-07-25"}]
[]
[null,"Parametry",null,null,null,null,null,null,null,null,"Vyhodnocení typu klienta"]
[]
[null,null,"Výše úvěru ( v CZK)",null,null,null,null,2000000,null,null,null,"Žadatel",null,"Občan ČR"]
[]
[null,null,"Fixní období",null,null,null,null,"3 roky",null,null,null,null,null,"Má české nebo slovenské RČ"]
[]
[null,null,"Odhadovaná tržní hodnota nemovitosti",null,null,null,null,3000000,null,null,null,"Příjmy",null,"Česká republika",null,null,null,{"$f":"adminTypKlienta","v":"Standardní klient"}]
[]
[]
[null,null,"LTV",null,null,null,null,{"$f":"IF(NemHodn=\"\",\"\",ROUNDUP(C_D,3))","v":0.66700000000000004},null,null,"Služby"]
[]
[null,null,"Doba splatnosti (v letech)",null,25,"(v měsících)",null,null,null,null,null,"Mimořádná splátka",null,"až 20% jistiny"]
[]
[]
[null,null,"Datum narození"]
[]
[null,null,"Věk klienta"]
[]
[null,null,"Doba čerpání (v měsících)"]
[]
[null,null,"Typ zastavované nemovitosti",null,null,"zděná nemovitost nebo pozemek"]
[]
[]
[null,"Slevy",null,null,null,null,"Slevy",null,null,null,"Jednorázové pojištění"]
[]
[null,null,"Jednorázové pojištění",null,null,"Ano",null,null,null,null,null,"Klient hradí JP",null,null,"Navýšením úvěru"]
[]
[null,null,"U-konto/Premium",null,null,"Ano",null,null,null,null,null,"Výše pojištění",null,null,{"$f":"SUM(adminSplatka!C30:C31)","v":60000}]
[]
[null,null,"Kreditní karta",null,null,"Ano",null,null,null,null,null,"Výše úvěru včetně pojištění",null,null,{"$f":"IF(SlevaCardif=\"Ano\",VyseUveruZaklad+vyseUveru2+IF(OR(O45=\"\",LEFT(O43,1)=\"Z\"),0,O45),VyseUveruZaklad+vyseUveru2)","v":2060000}]
[]
[null,null,"Marketingová sleva",null,null,null,null,0]
[]
[null,null,"Další předschválené slevy",null,null,null,null,0]
[]
[]
[null,"Standardní / Navržená výše poplatků"]
[]
[null,null,"Čerpání NnV:",null,"Za poskytnutí:",null,"Za odhad:"]
[]
[null,null,1500,null,2500,null,{"$f":"IF(nemNemovitost=\"\",0,nemNemovitost+nemNemovitost2+nemNemovitost3)","v":3700}]
[]
[]
[]
[]
[]
[]
[null,null,null,"Úroková sazba",null,null,null,null,null,null,null,null,"Měsíční splátka"]
[]
[]
[null,null,"Dokument je určen pouze k internímu použití! Není určeno k tisku!"]
[]
[]
[null,null,"Market Rate"]
[null,null,"Option spread"]
[null,null,"Special refinancing spread"]
[null,null,"Celkem FUNDING",null,null,{"$f":"IF(SplCsZmena = \"\",\"\",SUM(SplCsZmena,SplOsZmena,SplSrsZmena))","v":""}]
[null,null,"Přirážka k FUNDINGu (součet CM a RM)"]
[null,null,"Úroková sazba před výjimkou",null,null,{"$f":"IF(SplCsZmena = \"\",\"\",SUM(F74:H75))","v":""}]
[]
[]
[null,"Vyplňte"]
[]
[null,null,"Market Rate"]
[null,null,"Contry spread","CZK","Měna"]
[null,null,"Option spread"]
[null,null,"Special refinancing spread"]
[null,null,"Celkem FUNDING",null,null,{"$f":"IF(SplCsZmena2=\"\",\"\",SUM(SplCsZmena2,SplOsZmena2,SplSrsZmena2,SplCoSpZmena2))","v":""}]
[null,null,"Riziková marže"]
[null,null,"Commercial margin (před výjimkou)"]
[null,null,"Úroková sazba před výjimkou",null,null,{"$f":"IF(SplCsZmena2=\"\",\"\",SUM(F85:H87)+SplCoSpZmena2)","v":""}]
[]
[]
[]
[null,null,"Market Rate",null,null,3.8999999999999994E-3,null,null,null,null,null,"Datum konce fixního období",null,null,{"$f":"FinKonecFixu","v":"2019-02-24"}]
[null,null,"Option spread",null,null,2.0000000000000001E-4,null,null,null,null,null,"Datum splatnosti podle FINu",null,null,{"$f":"FinKonecUveru","v":"2016-07-25"}]
[null,null,"Special refinancing spread",null,null,1E-4]
[null,null,"Celkem FUNDING",null,null,4.1999999999999997E-3]
[null,null,"Riziková marže",null,null,8.4000000000000012E-3]
[null,null,"Commercial margin",null,null,5.1799999999999999E-2]
[null,null,"Úroková sazba před výjimkou",null,null,{"$f":"UrSazbaBezSl","v":6.4399999999999999E-2}]
[]
[]
[null,null,"Výsledek kontrol:"]
[]
[]
[]
[]
[]
[]
[]
[]
[]
[]
[]
[]
[]
[]
[]
[]
[]
[]
[]
[]
[]
[]
[]
[]
[]
[]
[]
[null,null,{"$f":"IF(SlevaCardif=\"Ne\",VyseUveruZaklad,VyseUveru)","v":2060000},{"$f":"NemHodn-C129","v":940000},false,false,null,0]

{"sheet":"adminSplatka","index":3,"n_rows":75,"n_cols":11,"rows_kept":75,"cut":false,"hidden":true,"merged":[[1,1,2,3],[1,4,2,6]]}
[]
[null,"Výpočet splátky",null,null,"Výpočet splátky pro Bonitu",null,null,null,"Kontrola změny dat"]
[null,null,null,null,null,null,null,null,"Aktuální","Puvodni",{"$f":"AND(K4:K19)","v":false}]
[null,"Produkt",{"$f":"IF(ISNA(VLOOKUP(IF(Flexi=\"až 100% jistiny (FLEXI)\",\"Hypoteční úvěr účelový rezidenční Flexi\",TypHypoteky),ProductMap,2,FALSE)),\"\",VLOOKUP(IF(Flexi=\"až 100% jistiny (FLEXI)\",\"Hypoteční úvěr účelový rezidenční Flexi\",TypHypoteky),ProductMap,2,FALSE))","v":"01a"},null,null,{"$f":"Product","v":"01a"},null,null,"Hypoteční úvěr účelový rezidenční Individual","Hypoteční úvěr účelový rezidenční Flexi",{"$f":"I4=J4","v":false}]
[null,"Žadatel",{"$f":"IF(MID(SplZadatel,7,2)=\"SR\",\"S\",MID(SplZadatel,1,1))","v":"O"},null,null,null,null,null,2000000,2000000,true]
[null,"Rodné číslo",{"$f":"MID(SplRodneCislo,1,1)","v":"M"},null,null,null,null,null," "," ",true]
[null,"Příjmy",{"$f":"MID(SplPrijmyV,1,1)","v":"Č"},{"$f":"Zadatel&RodneCislo&Prijmy","v":"OMČ"},null,null,null,null,{"$f":"NemHodn","v":3000000},2180000,false]
[null,"Typ klienta",{"$f":"IF(ISNA(VLOOKUP(IdentTypeKl,MappingTypKl,2,FALSE)),\"\",VLOOKUP(IdentTypeKl,MappingTypKl,2,FALSE))","v":"S"},{"$f":"IF(TypKlienta=\"\",\"Nevhodný klient\",IF(TypKlienta=\"S\",\"Standardní klient\",\"Nestandardní klient\"))","v":"Standardní klient"},null,null,null,null,0.66700000000000004,0.91800000000000004,false]
[null,"Produkt_sub",{"$f":"VratProductDomain(Product&\"_\"&TypKlienta,1)","v":"01a_S"},null,null,{"$f":"VratProductDomain(ProductBON&\"_\"&TypKlienta,1)","v":"01a_S"},null,null,25,15,false]
[null,"Fixace",{"$f":"IF(Fix_obdobi=\"Float s garancí\",\"CA\",MID(Fix_obdobi,1,2))","v":"3 "},null,null,"3 ",null,null,{"$f":"Vek","v":0},29292,false]
[null,"C_D (LTV)",{"$f":"(VyseUveruZaklad+vyseUveru2)/NemHodn","v":0.66666666666666663},null,null,null,null,null,"zděná nemovitost nebo pozemek","zděná nemovitost nebo pozemek",true]
[null,"C_D (LTV)iCardif",{"$f":"VyseUveru/NemHodn","v":0.68666666666666665},null,null,null,null,null,"Ano","Ano",true]
[null,"Splatnost",{"$f":"SplatnostPrepocetMesice","v":0},null,null,null,null,null,"Ano","Ne",false]
[null,"Typ Nemov.",{"$f":"IF(ISNA(VLOOKUP(SplTypNemovitosti,NemovitostMap,2,FALSE)),\"\",VLOOKUP(SplTypNemovitosti,NemovitostMap,2,FALSE))","v":"ZDE"},null,null,null,null,null,"Ano","Ano",true]
[null,"Cardif pro FL",{"$f":"IF(FIXACE=\"Fl\",SlevaCardif,IF(FIXACE=\"CA\",SlevaCardif,\"Ne\"))","v":"Ne"},null,"Sleva Cardif",null,null,null,0,0,true]
[null,"Cardif pro Fix",{"$f":"IF(FIXACE=\"Fl\",\"Ne\",IF(FIXACE=\"CA\",\"Ne\",SlevaCardif))","v":"Ano"},null,null,null,null,null,"Občan ČR","Občan ČR",true]
[null,"Akt bal FL",{"$f":"IF(FIXACE=\"Fl\",SlevaUcet,IF(FIXACE=\"CA\",SlevaUcet,\"Ne\"))","v":"Ne"},null,"sleva Bal",null,null,null,"Má české nebo slovenské RČ","Má české nebo slovenské RČ",true]
[null,"Kreditní karta",{"$f":"SlevaKarta","v":"Ano"},null,"sleva KK",null,null,null,"Česká republika","Česká republika",true]
[null,"Akt.bal Fix",{"$f":"IF(FIXACE=\"Fl\",\"Ne\",IF(FIXACE=\"CA\",\"Ne\",SlevaUcet))","v":"Ano"},null,null,null,null,null,"Navýšením úvěru","Z vlastních zdrojů",false]
[null,"Vypisovat","Ne"]
[null,"Sazby ke dni",{"$f":"Defsazby!B2","v":"2016-02-01"}]
[]
[null,"Úroková sazba",0,null,null,0]
[null,"Úr.sazba bez sl",6.4399999999999999E-2,null,null,null,"UrSazbaBezSlFL"]
[null,"Splátka"]
[]
[null,null,{"$f":"IF(AND(SlevaUcet=\"Ano\",SlevaKarta=\"Ano\"),\"klient bude aktivně využívat některé z Osobních kont banky dle svého výběru, libovolnou kreditní kartu UniCredit Bank Czech Republic and Slovakia, a.s.\",IF(SlevaUcet=\"Ano\",\"klient bude aktivně využívat některé z Osobních kont banky dle svého výběru\",IF(SlevaKarta=\"Ano\",\"klient bude aktivně využívat libovolnou kreditní kartu UniCredit Bank Czech Republic and Slovakia, a.s.\",\"\")))","v":"klient bude aktivně využívat některé z Osobních kont banky dle svého výběru, libovolnou kreditní kartu UniCredit Bank Czech Republic and Slovakia, a.s."}]
[null,null,{"$f":"IF(SlevaCardif=\"Ano\",\" a bude mít k danému úvěru sjednáno jednorázové pojištění (pojištění schopnosti splácet).\",\"\")","v":" a bude mít k danému úvěru sjednáno jednorázové pojištění (pojištění schopnosti splácet)."}]
[]
[null,"Pojištění účel",{"$f":"ROUNDUP((VyseUveruZaklad/100)*D30,0)","v":60000},{"$f":"VLOOKUP(\"CardifFeeInFront\",DefSpecPar!A:C,2,FALSE)","v":3}]
[null,"Pojištění neúčel",{"$f":"ROUNDUP((vyseUveru2/100)*D31,0)","v":0},{"$f":"VLOOKUP(\"CardifFeeInFront\",DefSpecPar!A:C,2,FALSE)","v":3}]
[]
[null,"Splatnost_Mesice",false,{"$f":"IF(Splatnost_Mesice=TRUE,DobaSplatnosti2,DobaSplatnosti2*12)","v":0},{"$f":"IF(Splatnost_Mesice=TRUE,DobaSplatnosti2/12,DobaSplatnosti2)","v":0}]
[]
[null,"Úroková sazba změna",{"$f":"SplCsZmena+SplOsZmena+SplSrsZmena+SplRmOmZmena","v":0},{"$f":"SplCsZmena2+SplOsZmena2+SplSrsZmena2+SplRmZmena2+SplOmZmena2","v":0}]
[]
[null,"Hypoteční úvěr účelový rezidenční Individual","Hypoteční úvěr účelový rezidenční Twin","Hypoteční úvěr účelový nerezidenční","Hypoteční úvěr neúčelový"]
[]
[null,"Koupě","Koupě","Koupě","Neúčelový"]
[null,"Výstavba","Výstavba","Výstavba"]
[null,"Rekonstrukce","Rekonstrukce","Rekonstrukce"]
[null,"Refinancování úvěru – zjednodušené","Refinancování úvěru – zjednodušené","Refinancování úvěru – standard"]
[null,"Refinancování úvěru – standard","Refinancování úvěru – standard","Vypořádání majetkových nároků"]
[null,"Vypořádání majetkových nároků","Vypořádání majetkových nároků","Zpětné proplacení vl. zdrojů"]
[null,"Zpětné proplacení vl. zdrojů","Zpětné proplacení vl. zdrojů","Pronájem"]
[null,"Získání práva nájmu / úhr. druž.  pod.","Získání práva nájmu / úhr. druž.  pod."]
[]
[]
[]
[]
[]
[]
[]
[]
[]
[]
[]
[]
[]
[]
[]
[]
[]
[]
[]
[]
[]
[]
[]
[]
[]
[]
[]
[]
[null,"Chyba: Výše neúčelové části úvěru není zadána"]

{"sheet":"Bonita","index":4,"n_rows":91,"n_cols":28,"rows_kept":91,"cut":false,"hidden":false,"merged":[[2,0,2,4],[4,4,4,7],[4,12,4,18],[7,1,7,13],[7,15,7,27],[33,11,33,12],[90,1,90,27],[66,1,66,13],[66,15,66,26],[87,2,87,3],[87,5,87,6],[87,9,87,11],[87,16,87,17],[87,19,87,21],[88,2,89,3],[88,5,89,6],[88,9,89,11],[88,16,89,17],[88,19,89,21]]}
[]
[]
["BONITA",null,null,null,null,null,null,null,null,null,null,null,null,null,null,null,null,null,null,null,null,null,null,null,null,null,null,{"$f":"manVerze","v":"v.14a"}]
[]
[null,"Jméno klienta",null,null,{"$f":"IF(SplatkaJmenoKlienta=\"\",\"\",SplatkaJmenoKlienta)","v":""},null,null,null,null,null,null,"Příjmení klienta",{"$f":"IF(SplPrijmeniKlienta = \"\",\"\",SplPrijmeniKlienta)","v":""}]
[]
[]
[null,"Příjmy žadatele",null,null,null,null,null,null,null,null,null,null,null,null,null,"Příjmy spolužadatele"]
[]
[null,"Dokládané příjmy",null,null,null,null,null,null,null,null,null,null,null,null,null,"Dokládané příjmy"]
[]
[]
[]
[]
[]
[]
[]
[]
[]
[]
[null,null,"Průměrný čistý měsíční příjem v posledních 12 měsících",null,null,null,null,null,null,null,null,null,null,null,null,null,"Průměrný čistý měsíční příjem v posledních 12 měsících"]
[]
[null,null,"Základní hrubá mzda (údaj dle prac. smlouvy)",null,null,null,null,null,null,null,null,null,null,null,null,null,"Základní hrubá mzda (údaj dle prac. smlouvy)"]
[]
[null,null,"4.příjem",null,null,null,null,{"$f":"IF(SUM(Mesic1,Mesic2,Mesic3)=MAX(Mesic1,Mesic2,Mesic3),0,IF(MAX(Mesic1,Mesic2,Mesic3)/((SUM(Mesic1,Mesic2,Mesic3)-MAX(Mesic1,Mesic2,Mesic3))/2)>1.3,(SUM(Mesic1,Mesic2,Mesic3)-MAX(Mesic1,Mesic2,Mesic3)+1.3*((SUM(Mesic1,Mesic2,Mesic3)-MAX(Mesic1,Mesic2,Mesic3))/2))/3,SUM(Mesic1,Mesic2,Mesic3)/3))","v":{"$error":"#NAME?"}},null,null,null,null,null,null,null,null,"4.příjem",null,null,null,{"$f":"IF(SUM(SpoMesic1,SpoMesic2,SpoMesic3)=MAX(SpoMesic1,SpoMesic2,SpoMesic3),0,IF(MAX(SpoMesic1,SpoMesic2,SpoMesic3)/((SUM(SpoMesic1,SpoMesic2,SpoMesic3)-MAX(SpoMesic1,SpoMesic2,SpoMesic3))/2)>1.3,(SUM(SpoMesic1,SpoMesic2,SpoMesic3)-MAX(SpoMesic1,SpoMesic2,SpoMesic3)+1.3*((SUM(SpoMesic1,SpoMesic2,SpoMesic3)-MAX(SpoMesic1,SpoMesic2,SpoMesic3))/2))/3,SUM(SpoMesic1,SpoMesic2,SpoMesic3)/3))","v":{"$error":"#REF!"}}]
[]
[null,null,"Výsledný měsíční příjem",null,null,null,null,{"$f":"IF(AND(Mesic1<>\"\",Mesic3<>\"\"),ROUND(IF(Mesic1 > Mesic3*1.2,Mesic3*1.2,Mesic1),0),\"\")","v":""},null,null,null,null,null,null,null,null,"Výsledný měsíční příjem",null,null,null,{"$f":"IF(AND(SpoMesic1<>\"\",SpoMesic3<>\"\"),ROUND(IF(SpoMesic1 > SpoMesic3*1.2,SpoMesic3*1.2,SpoMesic1),0),\"\")","v":""}]
[]
[]
[]
[]
[null,null,"Příjmy ze závislé činnosti (ř.31)",null,null,null,null,null,"Po odečtení pojistného",null,null,null,{"$f":"radek31-ROUND(IF(radek31<adminMaxZaklad,radek31*adminPojistnePodnikani,adminMaxZaklad*adminPojistnePodnikani),0)","v":0},null,null,null,"Příjmy ze závislé činnosti (ř.31)",null,null,null,null,"Po odečtení pojistného",null,null,null,{"$f":"T32-ROUND(IF(T32<1130640,T32*11%,1130640*11%),0)","v":0}]
[]
[null,null,"Příjmy z podnikání (ř.37)",null,null,null,null,null,"Po odečtení pojistného",null,null,{"$f":"adminZadVysledny","v":0},null,null,null,null,"Příjmy z podnikání (ř.37)",null,null,null,null,"Po odečtení pojistného",null,null,null,{"$f":"IF(SpoRadek37=\"\",\"\",IF(SpoPausal=\"Ano\",SpoRadek37,SpoRadek37-IF((ROUND(IF((T32+SpoRadek37)<adminMaxZaklad,SpoRadek37*adminPojistnePodnikani,(1130640-SpoRadek31)*adminPojistnePodnikani),0))<0,0,(ROUND(IF((SpoRadek31+SpoRadek37)<adminMaxZaklad,SpoRadek37*adminPojistnePodnikani,(adminMaxZaklad-SpoRadek31)*adminPojistnePodnikani),0)))))","v":""}]
[]
[null,null,"Výdaje u podnikání uplatňované paušálem?",null,null,null,null,null,null,null,null,null,null,null,null,null,"   Výdaje u podnikání uplatňované paušálem?"]
[]
[null,null,"Příjmy z pronájmu (ř.39)",null,null,null,null,null,null,null,null,null,null,null,null,null,"Příjmy z pronájmu (ř.39)"]
[]
[null,null,"Příjmy z kapitálového majetku (ř.38)",null,null,null,null,null,null,null,null,null,null,null,null,null,"Příjmy z kapitálového majetku (ř.38)"]
[]
[null,null,"Položky mimoř. zvyšující základ daně (ř.105)",null,null,null,null,null,null,null,null,null,null,null,null,null,"Položky mimoř. zvyšující základ daně (ř.105)"]
[]
[null,null,"Daň (ř.74)",null,null,null,null,null,null,null,null,null,null,null,null,null,"Daň (ř.74)"]
[]
[null,null,"Výsledný měsíční příjem",null,null,null,{"$f":"IF(adminBonita!C28=0,\"\",adminBonita!C28)","v":""},null,null,null,null,null,null,null,null,null,"Výsledný měsíční příjem",null,null,{"$f":"IF(OR(AND(SpoRadek37=\"\",SpoRadek39=\"\",SpoRadek38=\"\"),AND(SpoRadek74=\"\",SpoZavislaVysledny=\"\")),\"\",((SpoRadek31Odecteni+adminSpoRadek37Odecteni+SpoRadek39+SpoRadek38-SpoRadek105-SpoRadek74)*IF(SpoZavislaVysledny=\"\",1,1-adminDan))/12)","v":""}]
[]
[]
[]
[null," "]
[null,null,"Hrubý příjem z podnikání (ř.101)",null,null,null,null,null,null,null,null,null,null,null,null,null,"Hrubý příjem z podnikání (ř.101)"]
[]
[null,null,"Výsledný měsíční příjem",null,null,null,null,{"$f":"IF(HrubyPrijem=\"\",\"\",HrubyPrijem/2/12)","v":""},null,null,null,null,null,null,null,null,"Výsledný měsíční příjem",null,null,null,{"$f":"IF(SpoHrubyPrijem=\"\",\"\",SpoHrubyPrijem/2/12)","v":""}]
[]
[]
[]
[]
[null,null,"Měsíční příjem",null,null,null,null,null,null,null,null,null,null,null,null,null,"Měsíční příjem"]
[]
[]
[]
[]
[null,null,"Měsíční příjem",null,null,null,null,null,null,null,null,null,null,null,null,null,"Měsíční příjem"]
[]
[]
[]
[null,"Výdaje 1. domácnosti"]
[]
[]
[null,null,"Patří všichni žadatelé do jedné domácnosti?",null,null,null,"Ano"]
[]
[]
[]
[null,null,"Počet dospělých v domácnosti",null,null,null,1,null,null,"Náklady na domácnost",null,null,{"$f":"VLOOKUP(Bydliste&MIN(Dospeli+Deti,10),NakladDomacnosti,2,FALSE)","v":3400},null,null,null,"Počet dospělých v domácnosti",null,null,null,null,null,"Náklady na domácnost",null,null,{"$f":"IF(BonDomacnosti=\"Ano\",\"\",VLOOKUP(SpoBydliste&MIN(SpoDospeli+SpoDeti,10),NakladDomacnosti,2,FALSE))","v":""}]
[]
[null,null,"Počet dětí v domácnosti",null,null,null,0,null,null,"Osobní náklady",null,null,{"$f":"VLOOKUP(Bydliste&\"Dosp\",OsobniNaklady,2,FALSE)*Dospeli+VLOOKUP(Bydliste&\"Dite\",OsobniNaklady,2,FALSE)*Deti","v":4100},null,null,null,"Počet dětí v domácnosti",null,null,null,null,null,"Osobní náklady",null,null,{"$f":"IF(BonDomacnosti=\"Ano\",\"\",VLOOKUP(SpoBydliste&\"Dosp\",OsobniNaklady,2,FALSE)*SpoDospeli+VLOOKUP(SpoBydliste&\"Dite\",OsobniNaklady,2,FALSE)*SpoDeti)","v":""}]
[]
[null,null,"Současné bydliště",null,null,null,"Praha",null,null,"Měsíční platby pojištění",null,null,0,null,null,null,"Současné bydliště",null,null,null,null,null,"Měsíční platby pojištění"]
[]
[null,null,"Měsíční splátky úvěrů",null,null,null,0,null,null,"Ostatní pravidelné výdaje",null,null,0,null,null,null,"Měsíční splátky úvěrů",null,null,null,null,null,"Ostatní pravidelné výdaje"]
[]
[null,null,"Rámec kontokorentního úvěru",null,null,null,0,null,null,"Limit kreditní karty",null,null,0,null,null,null,"Rámec kontokorentního úvěru",null,null,null,null,null,"Limit kreditní karty"]
[]
[]
[]
[]
[]
[null,null,"Je bonita dostatečná?",null,null,"Měsíční splátka",null,null,null,"Debt ratio",null,null,null,null,null,null,"Max. možná výše úvěru",null,null,"Celk. uznatelný příjem"]
[null,null,{"$f":"IF(adminCelkovePrijmy = 0,\"\",IF(DR<=MaxDR,\"ANO\",\"NE\"))","v":""},null,null,{"$f":"IF(adminCelkovePrijmy = 0,\"\",SplatkaTrigger)","v":""},null,null,null,{"$f":"IF(prihlaseny=\"banka\",IF(adminCelkovePrijmy=0,\"\",TEXT(ROUNDUP(DR*100,0),\"0\")&\"% / max.\"&TEXT(ROUNDUP(MaxDR*100,0),\"0\")&\"%\"),IF(bonDostatecna=\"Ano\",\"Vyhovující\",IF(bonDostatecna=\"Ne\",\"Nevyhovující\",\"\")))","v":""},null,null,null,null,null,null,{"$f":"IF(adminCelkovePrijmy=0,\"\",adminMaxVyse)","v":""},null,null,{"$f":"IF(adminCelkovePrijmy = 0,\"\",adminCelkovePrijmy)","v":""}]
[]
[null,"Dokument je určen pouze k internímu použití! Není určeno k tisku!"]

{"sheet":"adminBonita","index":5,"n_rows":34,"n_cols":16,"rows_kept":34,"cut":false,"hidden":true,"merged":[[30,1,30,2],[19,5,19,6],[30,5,30,6],[1,8,2,8],[4,8,5,8],[7,5,7,6],[7,8,8,8],[19,1,19,2]]}
[]
[null,"VYPOČTENÉ PŘÍJMY","žadatel","Spolužadatel",null,"VYPOČTENÉ VÝDAJE","Spolužadatel",null,"Koeficient splátky","KTK","KK"]
[null,"Závislá",{"$f":"IF(ZavislaVysledny=\"\",0,ZavislaVysledny)","v":0},{"$f":"IF(SpoZavislaVysledny=\"\",0,SpoZavislaVysledny)","v":0},null,"Náklady na domácnost",{"$f":"IF(SpoDomacnost=\"\",0,SpoDomacnost)","v":0},null,null,6.4224299999999998E-2,3.4569999999999997E-2]
[null,"Daňové",{"$f":"IF(DanoveVysledny=\"\",0,DanoveVysledny)","v":0},{"$f":"IF(SpoDanoveVysledny=\"\",0,SpoDanoveVysledny)","v":0},null,"Osobní náklady",{"$f":"IF(SpoOsobni=\"\",0,SpoOsobni)","v":0}]
[null,"Hrubé",{"$f":"IF(HrubyVysledny=\"\",0,HrubyVysledny)","v":0},{"$f":"IF(SpoHrubyVysledny=\"\",0,SpoHrubyVysledny)","v":0},null,null,null,null,"Pojistné","závislá činnost","podnikání","max. základ","SP","ZP","min SP","min ZP"]
[null,"Ostatní",{"$f":"IF(OstatniMesicni=\"\",0,OstatniMesicni)","v":0},{"$f":"IF(SpoOstatniMesicni=\"\",0,SpoOstatniMesicni)","v":0},null,"Daň",0.15,null,null,0.11,0.2135,1130640,0.29199999999999998,0.13500000000000001,{"$f":"1943*12","v":23316},{"$f":"1797*12","v":21564}]
[null,"Přímé",{"$f":"IF(PrimeMesicni=\"\",0,PrimeMesicni)","v":0},{"$f":"IF(SpoPrimeMesicni=\"\",0,SpoPrimeMesicni)","v":0}]
[null,"celkem",{"$f":"SUM(adminOblastPrijmyZadatel)","v":0},{"$f":"SUM(adminOblastPrijmySpoluzadatel)","v":0},null,"řádek 37 po odečtení pojistného",null,null,"Podnikání stropy","max","min","min SP","min ZP"]
[null,null,null,null,null,"žadatel",{"$f":"IF(Radek37Odecteni = \"\",0,Radek37Odecteni)","v":0},null,null,{"$f":"1296288*2","v":2592576},{"$f":"64813*2","v":129626},{"$f":"O6/M6","v":79849.315068493161},{"$f":"P6/N6","v":159733.33333333331}]
[null,"Celkový příjem",{"$f":"SUM(adminOblastPrijmy)","v":0},null,null,"spolužadatel",{"$f":"IF(SpoRadek37Odecteni = \"\",0,SpoRadek37Odecteni)","v":0}]
[null,"Ostatní splátky",{"$f":"Splatky+KTK*adminKoefKtk+KK*adminKoefKK+SpoSplatky+SpoKtk*adminKoefKtk+SpoKk*adminKoefKK","v":0},null,null,null,null,null,"činnost","ZP","SP","celkem",true]
[null,"Celkový výdaj",{"$f":"ZadDomacnost+ZadNaklady+VydPojisteni+VydOstatni+adminSpoDomacnost+adminSpoOsobni+SpoPojisteni+SpoVydaje+adminOstatniSplatky","v":7500},null,null,null,null,null,"Podnikání",{"$f":"IF(radek37>J9,(J9/2)*N6,IF(radek37<M9,P6,(radek37/2)*N6))","v":21564},{"$f":"IF(radek37>J9,(J9/2)*M6,IF(radek37<L9,O6,(radek37/2)*M6))","v":23316},{"$f":"J12+K12","v":44880},{"$f":"IF(D27=TRUE,IF(D21=FALSE,IF(D25=FALSE,IF(D29=FALSE,IF(D23=FALSE,TRUE,FALSE)))))","v":false}]
[null,"Disponibilní zdroje",{"$f":"C10-C12","v":-7500},null,null,null,null,null,"Podnikání při ZČ",{"$f":"IF(radek37>J9,(J9/2)*N6,((radek37/2)*N6))","v":0},{"$f":"IF(radek37<K9,0,IF(radek37>J9,(J9/2)*M6,(radek37/2)*M6))","v":0},{"$f":"SUM(J13,K13)","v":0},{"$f":"IF(D27=TRUE,IF(D21=TRUE,IF(D25=FALSE,IF(D29=FALSE,IF(D23=FALSE,TRUE,FALSE)))))","v":false}]
[null,"Splátka pro Bonitu",{"$f":"SplatkaBON","v":0},null,null,null,null,null,"Pronájem",{"$f":"1148*12","v":13776},0,{"$f":"IF(ZavislaVysledny=\"\",IF(radek37=\"\",IF(radek38=\"\",IF(ZadRadek105=\"\",IF(D27=TRUE,(J14+K14+(C24*0.15)),IF(radek39<>\"\",J14+K14,0))))))","v":0},{"$f":"IF(D27=TRUE,IF(D21=FALSE,IF(D25=FALSE,IF(D29=FALSE,IF(D23=FALSE,IF(adminBonita!C24>0,TRUE,FALSE))))))","v":false}]
[null,"DR",{"$f":"IF(adminDisponibilniZdroje<=0,999999,(adminSplatkaBon+adminOstatniSplatky) / (adminDisponibilniZdroje+adminOstatniSplatky))","v":999999},null,null,null,null,null,"Pronájem a ZČ",null,null,{"$f":"IF(M15=TRUE,radek39*0.15,0)","v":0},{"$f":"IF(D21=TRUE,IF(D27=TRUE,TRUE,FALSE))","v":false}]
[null,"LTV C_D",{"$f":"C_D","v":0.66666666666666663}]
[null,"Max DR"]
[null,"maximální výše úvěru"]
[]
[null,"Zadatel podnikani",null,"zav.čin.",null,"Spoluzadatel podnikani"]
[null,"radek31",{"$f":"radek31","v":0},false,null,"radek31",{"$f":"SpoRadek31","v":0}]
[null,"radek37",{"$f":"radek37","v":0},"ost.st.přij.",null,"radek37",{"$f":"SpoRadek37","v":0}]
[null,"pausal",{"$f":"PausalZad","v":0},false,null,"pausal",{"$f":"SpoPausal","v":0}]
[null,"radek39",{"$f":"radek39","v":0},"přímé zadání",null,"radek39",{"$f":"SpoRadek39","v":0}]
[null,"radek38",{"$f":"radek38","v":0},false,null,"radek38",{"$f":"SpoRadek38","v":0}]
[null,"radek105",{"$f":"ZadRadek105","v":0},"přijem z d.p.",null,"radek105",{"$f":"SpoRadek105","v":0}]
[null,"radek74",{"$f":"radek74","v":0},false,null,"radek74",{"$f":"SpoRadek74","v":0}]
[null,"Výsledný příjem",{"$f":"IF(OR(AND(radek37=\"\",radek39=\"\",radek38=\"\")),0,(IF(M12=TRUE,adminZadVysledny+radek39+radek38-ZadRadek105-radek74-L14,IF(SoubehZC_Podnikani=TRUE,adminZadVysledny+radek39+radek38-ZadRadek105-L15-(C22*0.15),adminZadVysledny+radek39+radek38-ZadRadek105-radek74-L15)))/12)","v":0},"hrubý podn.",null,"Výsledný příjem",{"$f":"IF(OR(AND(SpoRadek37=\"\",SpoRadek39=\"\",SpoRadek38=\"\"),AND(SpoRadek74=\"\",SpoZavislaVysledny=\"\")),\"\",((SpoRadek31Odecteni+adminSpoRadek37Odecteni+SpoRadek39+SpoRadek38-SpoRadek105-SpoRadek74)*IF(SpoZavislaVysledny=\"\",1,1-adminDan))/12)","v":""}]
[null,"Odečtení pojistného",{"$f":"IF(radek37=\"\",0,IF(PausalZad=\"Ano\",radek37,radek37-(IF(M12=TRUE,L12+L14+L15,L13+L14+L15))))","v":0},false,null,"Odečtení pojistného",{"$f":"IF(SpoRadek37=\"\",\"\",IF(SpoPausal=\"Ano\",SpoRadek37,SpoRadek37-IF((ROUND(IF((T32+SpoRadek37)<adminMaxZaklad,SpoRadek37*adminPojistnePodnikani,(1130640-SpoRadek31)*adminPojistnePodnikani),0))<0,0,(ROUND(IF((SpoRadek31+SpoRadek37)<adminMaxZaklad,SpoRadek37*adminPojistnePodnikani,(adminMaxZaklad-SpoRadek31)*adminPojistnePodnikani),0)))))","v":""}]
[]
[null,"Zadatel zč",null,null,null,"Spoluzadatel zč"]
[null,"čistý měsíční",{"$f":"Mesic1","v":0},null,null,"čistý měsíční",{"$f":"SpoMesic1","v":0}]
[null,"základní hrubá mzda",{"$f":"Mesic3","v":0},null,null,"základní hrubá mzda",{"$f":"SpoMesic3","v":0}]
[null,"Výsledný příjem",{"$f":"IF(AND(Mesic1<>\"\",Mesic3<>\"\"),ROUND(IF(Mesic1 > Mesic3*1.2,Mesic3*1.2,Mesic1),0),\"\")","v":""},null,null,"Výsledný příjem",{"$f":"IF(AND(SpoMesic1<>\"\",SpoMesic3<>\"\"),ROUND(IF(SpoMesic1 > SpoMesic3*1.2,SpoMesic3*1.2,SpoMesic1),0),\"\")","v":""}]

{"sheet":"Nabidka","index":6,"n_rows":118,"n_cols":46,"rows_kept":118,"cut":false,"hidden":true,"merged":[[2,0,2,12],[12,9,12,26],[13,9,13,26],[14,9,14,26],[17,22,17,37],[15,9,15,26],[18,22,18,37],[19,22,19,37],[20,22,20,37],[21,22,21,24],[22,22,22,37],[23,22,23,37],[24,22,24,34],[51,9,51,26],[25,22,25,37],[32,4,33,37],[38,4,38,37],[39,5,39,36],[42,5,44,37],[40,5,41,37],[42,42,42,43],[46,4,46,37],[48,9,48,26],[49,9,49,26],[50,9,50,26],[81,4,82,37],[62,4,64,37],[65,4,65,37],[67,4,68,37],[71,4,71,30],[72,4,72,30],[73,4,73,30],[74,4,74,30],[75,4,75,30],[76,4,76,30],[77,4,77,30],[78,4,78,30],[100,4,100,37],[85,4,85,30],[86,4,86,30],[87,4,87,30],[88,4,88,30],[89,4,89,30],[90,4,90,30],[91,4,91,30],[92,4,92,30],[93,4,93,30],[94,4,94,30],[97,4,98,37],[117,4,117,30],[101,6,101,25],[102,6,102,25],[103,6,103,25],[104,4,105,37],[106,4,106,30],[111,4,111,30],[112,4,112,30],[113,4,113,30],[114,4,114,37],[115,4,115,30],[116,4,116,30]]}
[]
[]
["NABÍDKA",null,null,null,null,null,null,null,null,null,null,null,null,null,null,null,null,null,null,null,null,null,null,null,null,null,null,null,null,null,null,null,null,null,null,null,null,null,null,null,null,null,null,null,null,"v.12"]
[]
[]
[]
[]
[null,null,null,null,"Orientační nabídka hypotečního úvěru"]
[]
[]
[]
[]
[null,null,null,null,"Klient:",null,null,null,null,{"$f":"SplatkaJmenoKlienta & \" \" & SplPrijmeniKlienta","v":" "}]
[null,null,null,null,"E-mail:"]
[null,null,null,null,"Telefon:"]
[null,null,null,null,"Dne:",null,null,null,null,{"$f":"TODAY()","v":"2016-02-02"}]
[]
[null,null,null,null,"Typ produktu",null,null,null,null,null,null,null,null,null,null,null,null,null,null,null,null,null,{"$f":"IF(Flexi=\"až 100% jistiny (FLEXI)\",\"Hypoteční úvěr účelový rezidenční Flexi\",TypHypoteky)","v":"Hypoteční úvěr účelový rezidenční Individual"}]
[null,null,null,null,"Výše úvěru",null,null,null,null,null,null,null,null,null,null,null,null,null,null,null,null,null,{"$f":"IF(SlevaCardif=\"Ne\",VyseUveruZaklad+vyseUveru2,VyseUveru)&\" Kč\"&IF(AND(SlevaCardif=\"Ano\",CardifTyp=\"Navýšením úvěru\"),\" *\",\"\")","v":"2060000 Kč *"}]
[null,null,null,null,"Fixní období",null,null,null,null,null,null,null,null,null,null,null,null,null,null,null,null,null,{"$f":"Fix_obdobi","v":"3 roky"}]
[null,null,null,null,"Doba splatnosti",null,null,null,null,null,null,null,null,null,null,null,null,null,null,null,null,null,{"$f":"Splatka!H29","v":0}]
[null,null,null,null,"Úroková sazba",null,null,null,null,null,null,null,null,null,null,null,null,null,null,null,null,null,{"$f":"SazbaTrigger","v":0},null,null,"p. a."]
[null,null,null,null,"Výše splátky",null,null,null,null,null,null,null,null,null,null,null,null,null,null,null,null,null,{"$f":"SplatkaTrigger","v":0}]
[null,null,null,null,"Měsíční poplatek za správu úvěru",null,null,null,null,null,null,null,null,null,null,null,null,null,null,null,null,null,0]
[null,null,null,null,"Poplatek za poskytnutí úvěru",null,null,null,null,null,null,null,null,null,null,null,null,null,null,null,null,null,{"$f":"IF(splPoplPoskZmena=\"\",splPoplPosk,splPoplPoskZmena)","v":2500}]
[null,null,null,null,"Maximální výše úvěru (při uvedeném příjmu a výdajích)",null,null,null,null,null,null,null,null,null,null,null,null,null,null,null,null,null,{"$f":"adminMaxVyse","v":0}]
[null,null,null,null,{"$f":"IF(AND(SlevaCardif=\"Ano\",CardifTyp=\"Navýšením úvěru\"),\"* Uvedená hodnota výše úvěru je včetně částky pojistného za jednorázové úvěrové pojištění \",\"\")","v":"* Uvedená hodnota výše úvěru je včetně částky pojistného za jednorázové úvěrové pojištění "}]
[]
[null,null,null,null,"Typ produktu",null,null,null,null,null,null,null,null,null,null,null,null,null,null,null,null,null,"Nabídka Banky**"]
[null,null,null,null,{"$f":"IF(SlevaUcet=\"Ano\",\"ü\",\"û\")","v":"ü"},null,"Balíček",null,null,null,null,null,null,null,null,null,null,null,null,null,null,null,"U-Konto/Premium Konto"]
[null,null,null,null,{"$f":"IF(SlevaKarta=\"Ano\",\"ü\",\"û\")","v":"ü"},null,"Kreditní karta"]
[null,null,null,null,{"$f":"IF(SlevaCardif=\"Ano\",\"ü\",\"û\")","v":"ü"},null,"Jednorázové úvěrové pojištění",null,null,null,null,null,null,null,null,null,null,null,null,null,null,null,"Pojištění schopnosti splácet"]
[]
[]
[null,null,null,null,"** Detaily produktů najdete v příloze této nabídky"]
[]
[]
[null,null,null,null,"Úrokovou sazbu Vám v uvedené výši rezervujeme za těchto předpokladů:"]
[null,null,null,null,"·         požadované parametry úvěru (účel úvěru, výše úvěru, doba splatnosti, fixní období) zůstanou beze změn"]
[null,null,null,null,"·",{"$f":"\" hodnota nemovitosti, která bude sloužit k zajištění úvěru, bude ve výši alespoň \"&NemHodn&\" Kč\"","v":" hodnota nemovitosti, která bude sloužit k zajištění úvěru, bude ve výši alespoň 3000000 Kč"}]
[null,null,null,null,"·         klient bude aktivně využívat některé z Osobních kont banky dle svého výběru, libovolnou kreditní kartu UniCredit Bank Czech Republic and Slovakia, a.s. a bude mít k danému úvěru sjednáno jednorázové pojištění (pojištění schopnosti splácet).",{"$f":"info1&info2","v":"klient bude aktivně využívat některé z Osobních kont banky dle svého výběru, libovolnou kreditní kartu UniCredit Bank Czech Republic and Slovakia, a.s. a bude mít k danému úvěru sjednáno jednorázové pojištění (pojištění schopnosti splácet)."}]
[]
[null,null,null,null,"·",{"$f":"\"nejpozději do \"&TEXT(NOW()+14,\"d.m.rrrr\")&\" včetně bude do banky doručena kompletní žádost o úvěr (tj. vyplněná a podepsaná žádost o úvěr včetně všech požadovaných podkladů) a současně \"&\"nejpozději do 30 kalendářních  dnů od data doručení kompletní žádosti o úvěr do banky bude mezi bankou a klientem podepsána smlouva o poskytnutí hypotečního úvěru.\"","v":"nejpozději do 16.2.2016 včetně bude do banky doručena kompletní žádost o úvěr (tj. vyplněná a podepsaná žádost o úvěr včetně všech požadovaných podkladů) a současně nejpozději do 30 kalendářních  dnů od data doručení kompletní žádosti o úvěr do banky bude mezi bankou a klientem podepsána smlouva o poskytnutí hypotečního úvěru."}]
[]
[]
[]
[null,null,null,null,"Děkujeme za Váš zájem. V případě dotazů nás, prosím, neváhejte kontaktovat. Těšíme se na naší spolupráci."]
[]
[null,null,null,null,{"$f":"IF(prihlaseny=\"banka\",\"Jméno bankéře:\",\"Jméno poradce:\")","v":"Jméno poradce:"}]
[null,null,null,null,{"$f":"IF(prihlaseny=\"banka\",\"Pobočka:\",\"Společnost:\")","v":"Společnost:"}]
[null,null,null,null,"E-mail:"]
[null,null,null,null,"Telefon:"]
[]
[]
[]
[]
[]
[]
[]
[]
[]
[]
[null,null,null,null,"Tato nabídka je pouze indikativní, není návrhem na uzavření smlouvy a nelze z ní proto dovozovat povinnost banky uskutečnit jakékoliv transakce. Případné uzavření smlouvy nebo uskutečnění transakce je vázáno na získání potřebných interních schválení v rámci banky a na podepsání příslušné smluvní dokumentace."]
[]
[]
[null,null,null,null,"Výhody dalších produktů"]
[]
[null,null,null,null,"U KONTO můžete mít jednoduše zcela  zdarma a nemusíte splnit žádné složité podmínky. Stačí, když se k nám každý měsíc budete posílat svůj příjem v minimální výši 12 000 Kč. "]
[]
[]
[null,null,null,null,"V rámci U konta získáváte:"]
[null,null,null,null,"·         Vedení konta bez měsíčního poplatku"]
[null,null,null,null,"·         Výběry ze všech bankomatů v ČR i ve světě"]
[null,null,null,null,"·         Standardní tuzemské online platby "]
[null,null,null,null,"·         Mezinárodní platební kartu"]
[null,null,null,null,"·         Internetové bankovnictví Smart Banking a Online Banking"]
[null,null,null,null,"·         Měsíční elektronický výpis"]
[null,null,null,null,"·         Smart klíč"]
[null,null,null,null,"·        Běžný účet v Kč a druhý v cizí měně "]
[]
[]
[null,null,null,null,"PREMIUM KONTO můžete mít jednoduše zcela  zdarma a nemusíte splnit žádné složité podmínky. Stačí, když se k nám každý měsíc budete posílat svůj příjem v minimální výši 50 000 Kč. "]
[]
[]
[null,null,null,null,"V rámci U konta získáváte:"]
[null,null,null,null,"·         Vedení konta"]
[null,null,null,null,"·         Výběry ze všech bankomatů v ČR i ve světě"]
[null,null,null,null,"·         Až 3 platební karty včetně 2 zlatých"]
[null,null,null,null,"·         Standardní tuzemské online platby"]
[null,null,null,null,"·         Internetové bankovnictví Smart Banking a Online Banking"]
[null,null,null,null,"·         Měsíční elektronický výpis"]
[null,null,null,null,"·         Smart klíč"]
[null,null,null,null,"·        Běžný účet v Kč a druhý v cizí měně "]
[null,null,null,null,"·         Kontokorent (povolené přečerpání účtu)"]
[null,null,null,null,"·         Zdravotní asistenci PREMIUM s lékařem na telefonu 24 hodin denně."]
[]
[]
[null,null,null,null,"POJIŠTĚNÍ SCHOPNOSTI SPLÁCET - CPI (Credit Protection Insurance) –je úvěrové pojištění, které chrání Vás a vaší rodinu při výpadku pravidelných příjmů."]
[]
[]
[null,null,null,null,"·         Standardní součástí CPI je pojištění pro případ úmrtí a dále si můžete zvolit jedno z následujících připojištění:"]
[null,null,null,null,null,null,"o   Nedobrovolná ztráta zaměstnání,"]
[null,null,null,null,null,null,"o   Dočasná pracovní neschopnost,"]
[null,null,null,null,null,null,"o   Invalidita III. Stupně."]
[null,null,null,null,"·         Rychlost a snadnost sjednání - stačí vyslovit souhlas s rámcovou pojistnou smlouvou a Všeobecnými pojistnými podmínkami"]
[]
[null,null,null,null,"·         Asistenční služby 24 hodin denně 365 dní v roce"]
[]
[]
[null,null,null,null,"KREDITNÍ KARTA  - Mezinárodní platební karta s úvěrovým limitem"]
[]
[null,null,null,null,"·         Peněžní rezerva k dispozici kdykoliv a bez ručitele"]
[null,null,null,null,"·         Bezúročné období pro platbu kartou až 45 dní"]
[null,null,null,null,"·         Zavolej a zaplať  - služba, která Vám pošle peníze z vaší kreditní karty na jakýkoliv účet v ČR"]
[null,null,null,null,"·         Přímé slevy při placení kreditní kartou u vybraných partnerů – www.unicreditbank.cz/slevynakartach"]
[null,null,null,null,"·         Výběr hotovosti Cash Back při platbě za zboží a služby u vybraných obchodníků"]
[null,null,null,null,"·         Platnost karty 3 roky s automatickou obnovou"]
[null,null,null,null,"·         Služba 3D Secure pro bezpečné platby na Internetu"]

{"sheet":"Kalendar","index":7,"n_rows":141,"n_cols":13,"rows_kept":141,"cut":false,"hidden":true,"merged":[[2,1,2,3],[16,6,18,11]]}
[]
[]
[null,"ORIENTAČNÍ SPLÁTKOVÝ KALENDÁŘ",null,null,null,null,null,null,null,null,null,null,{"$f":"manVerze","v":"v.14a"}]
[]
[null,null,"Jméno klienta:",{"$f":"SplatkaJmenoKlienta&\" \" &SplPrijmeniKlienta","v":" "},null,null,null,null,null,null,"Vyhotoveno dne:",{"$f":"TODAY()","v":"2016-02-02"}]
[]
[]
[]
[null,null,"Výše úvěru ( v CZK):",{"$f":"VyseUveru","v":2060000},null,null,"Dokument je určen pouze k internímu použití! Není určeno k tisku!"]
[]
[null,null,"Úroková sazba:",{"$f":"SazbaTrigger","v":0}]
[]
[null,null,"Datum čerpání:","2015-05-23"]
[]
[null,null,"Datum první splátky:",{"$f":"DATE(YEAR(CerpaniD),MONTH(CerpaniD),25)","v":"2015-05-25"}]
[]
[null,null,"Měsíční splátka:",{"$f":"SplatkaTrigger","v":0},null,null,{"$f":"IF(vypocteno,\"\",\"Kalendář není aktuální. Vypočtěte jej prosím znovu.\")","v":"Kalendář není aktuální. Vypočtěte jej prosím znovu."}]
[]
[null,null,"Doba splatnosti v měsících:",{"$f":"Splatnost","v":0}]
[null,null,null,null,null,null,"č.","Datum","Splátka","Úrok","Úmor","Nesplacená jistina"]
[null,null,null,null,null,null,1,"2015-05-25",109.41,109.41,0,824000]
[null,null,null,null,null,null,2,"2015-06-25",7727,1641.13,6085.87,817914.13]
[null,null,null,null,null,null,3,"2015-07-25",7727,1629.01,6097.99,811816.14]
[null,null,null,null,null,null,4,"2015-08-25",7727,1616.87,6110.13,805706.01]
[null,null,null,null,null,null,5,"2015-09-25",7727,1604.7,6122.3,799583.71]
[null,null,null,null,null,null,6,"2015-10-25",7727,1592.5,6134.5,793449.21]
[null,null,null,null,null,null,7,"2015-11-25",7727,1580.29,6146.71,787302.5]
[null,null,null,null,null,null,8,"2015-12-25",7727,1568.04,6158.96,781143.54]
[null,null,null,null,null,null,9,"2016-01-25",7727,1555.78,6171.22,774972.32000000007]
[null,null,null,null,null,null,10,"2016-02-25",7727,1543.49,6183.51,768788.81]
[null,null,null,null,null,null,11,"2016-03-25",7727,1531.17,6195.83,762592.9800000001]
[null,null,null,null,null,null,12,"2016-04-25",7727,1518.83,6208.17,756384.81]
[null,null,null,null,null,null,13,"2016-05-25",7727,1506.47,6220.53,750164.28]
[null,null,null,null,null,null,14,"2016-06-25",7727,1494.08,6232.92,743931.36]
[null,null,null,null,null,null,15,"2016-07-25",7727,1481.66,6245.34,737686.02]
[null,null,null,null,null,null,16,"2016-08-25",7727,1469.22,6257.78,731428.24]
[null,null,null,null,null,null,17,"2016-09-25",7727,1456.76,6270.24,725158]
[null,null,null,null,null,null,18,"2016-10-25",7727,1444.27,6282.73,718875.27]
[null,null,null,null,null,null,19,"2016-11-25",7727,1431.76,6295.24,712580.03]
[null,null,null,null,null,null,20,"2016-12-25",7727,1419.22,6307.78,706272.25]
[null,null,null,null,null,null,21,"2017-01-25",7727,1406.66,6320.34,699951.91]
[null,null,null,null,null,null,22,"2017-02-25",7727,1394.07,6332.93,693618.98]
[null,null,null,null,null,null,23,"2017-03-25",7727,1381.46,6345.54,687273.44]
[null,null,null,null,null,null,24,"2017-04-25",7727,1368.82,6358.18,680915.25999999989]
[null,null,null,null,null,null,25,"2017-05-25",7727,1356.16,6370.84,674544.41999999993]
[null,null,null,null,null,null,26,"2017-06-25",7727,1343.47,6383.53,668160.8899999999]
[null,null,null,null,null,null,27,"2017-07-25",7727,1330.75,6396.25,661764.6399999999]
[null,null,null,null,null,null,28,"2017-08-25",7727,1318.01,6408.99,655355.64999999991]
[null,null,null,null,null,null,29,"2017-09-25",7727,1305.25,6421.75,648933.89999999991]
[null,null,null,null,null,null,30,"2017-10-25",7727,1292.46,6434.54,642499.35999999987]
[null,null,null,null,null,null,31,"2017-11-25",7727,1279.6400000000001,6447.36,636051.99999999988]
[null,null,null,null,null,null,32,"2017-12-25",7727,1266.8,6460.2,629591.79999999993]
[null,null,null,null,null,null,33,"2018-01-25",7727,1253.94,6473.0599999999995,623118.73999999987]
[null,null,null,null,null,null,34,"2018-02-25",7727,1241.04,6485.96,616632.77999999991]
[null,null,null,null,null,null,35,"2018-03-25",7727,1228.1300000000001,6498.87,610133.90999999992]
[null,null,null,null,null,null,36,"2018-04-25",7727,1215.18,6511.82,603622.09]
[null,null,null,null,null,null,37,"2018-05-25",7727,1202.21,6524.79,597097.29999999993]
[null,null,null,null,null,null,38,"2018-06-25",7727,1189.22,6537.78,590559.5199999999]
[null,null,null,null,null,null,39,"2018-07-25",7727,1176.2,6550.8,584008.71999999986]
[null,null,null,null,null,null,40,"2018-08-25",7727,1163.1500000000001,6563.85,577444.86999999988]
[null,null,null,null,null,null,41,"2018-09-25",7727,1150.08,6576.92,570867.94999999984]
[null,null,null,null,null,null,42,"2018-10-25",7727,1136.98,6590.02,564277.92999999982]
[null,null,null,null,null,null,43,"2018-11-25",7727,1123.8499999999999,6603.15,557674.7799999998]
[null,null,null,null,null,null,44,"2018-12-25",7727,1110.7,6616.3,551058.47999999975]
[null,null,null,null,null,null,45,"2019-01-25",7727,1097.52,6629.48,544428.99999999977]
[null,null,null,null,null,null,46,"2019-02-25",7727,1084.32,6642.68,537786.31999999972]
[null,null,null,null,null,null,47,"2019-03-25",7727,1071.0899999999999,6655.91,531130.40999999968]
[null,null,null,null,null,null,48,"2019-04-25",7727,1057.83,6669.17,524461.23999999964]
[null,null,null,null,null,null,49,"2019-05-25",7727,1044.55,6682.45,517778.78999999963]
[null,null,null,null,null,null,50,"2019-06-25",7727,1031.24,6695.76,511083.02999999962]
[null,null,null,null,null,null,51,"2019-07-25",7727,1017.91,6709.09,504373.93999999959]
[null,null,null,null,null,null,52,"2019-08-25",7727,1004.54,6722.46,497651.47999999957]
[null,null,null,null,null,null,53,"2019-09-25",7727,991.16,6735.84,490915.63999999955]
[null,null,null,null,null,null,54,"2019-10-25",7727,977.74,6749.26,484166.37999999954]
[null,null,null,null,null,null,55,"2019-11-25",7727,964.3,6762.7,477403.67999999953]
[null,null,null,null,null,null,56,"2019-12-25",7727,950.83,6776.17,470627.50999999954]
[null,null,null,null,null,null,57,"2020-01-25",7727,937.33,6789.67,463837.83999999956]
[null,null,null,null,null,null,58,"2020-02-25",7727,923.81,6803.1900000000005,457034.64999999956]
[null,null,null,null,null,null,59,"2020-03-25",7727,910.26,6816.74,450217.90999999957]
[null,null,null,null,null,null,60,"2020-04-25",7727,896.68,6830.32,443387.58999999956]
[null,null,null,null,null,null,61,"2020-05-25",7727,883.08,6843.92,436543.66999999958]
[null,null,null,null,null,null,62,"2020-06-25",7823,1051.3399999999999,6771.66,429772.0099999996]
[null,null,null,null,null,null,63,"2020-07-25",7823,1035.03,6787.97,422984.03999999963]
[null,null,null,null,null,null,64,"2020-08-25",7823,1018.69,6804.3099999999995,416179.72999999963]
[null,null,null,null,null,null,65,"2020-09-25",7823,1002.3,6820.7,409359.02999999962]
[null,null,null,null,null,null,66,"2020-10-25",7823,985.87,6837.13,402521.89999999962]
[null,null,null,null,null,null,67,"2020-11-25",7823,969.41,6853.59,395668.30999999959]
[null,null,null,null,null,null,68,"2020-12-25",7823,952.9,6870.1,388798.20999999961]
[null,null,null,null,null,null,69,"2021-01-25",7823,936.36,6886.64,381911.5699999996]
[null,null,null,null,null,null,70,"2021-02-25",7823,919.77,6903.23,375008.33999999962]
[null,null,null,null,null,null,71,"2021-03-25",7823,903.15,6919.85,368088.48999999964]
[null,null,null,null,null,null,72,"2021-04-25",7823,886.48,6936.52,361151.96999999962]
[null,null,null,null,null,null,73,"2021-05-25",7823,869.77,6953.23,354198.73999999964]
[null,null,null,null,null,null,74,"2021-06-25",7823,853.03,6969.97,347228.76999999967]
[null,null,null,null,null,null,75,"2021-07-25",7823,836.24,6986.76,340242.00999999966]
[null,null,null,null,null,null,76,"2021-08-25",7823,819.42,7003.58,333238.42999999964]
[null,null,null,null,null,null,77,"2021-09-25",7823,802.55,7020.45,326217.97999999963]
[null,null,null,null,null,null,78,"2021-10-25",7823,785.64,7037.36,319180.61999999965]
[null,null,null,null,null,null,79,"2021-11-25",7823,768.69,7054.3099999999995,312126.30999999965]
[null,null,null,null,null,null,80,"2021-12-25",7823,751.7,7071.3,305055.00999999966]
[null,null,null,null,null,null,81,"2022-01-25",7823,734.67,7088.33,297966.67999999964]
[null,null,null,null,null,null,82,"2022-02-25",7823,717.6,7105.4,290861.27999999962]
[null,null,null,null,null,null,83,"2022-03-25",7823,700.49,7122.51,283738.76999999961]
[null,null,null,null,null,null,84,"2022-04-25",7823,683.34,7139.66,276599.10999999964]
[null,null,null,null,null,null,85,"2022-05-25",7823,666.14,7156.86,269442.24999999965]
[null,null,null,null,null,null,86,"2022-06-25",7823,648.91,7174.09,262268.15999999963]
[null,null,null,null,null,null,87,"2022-07-25",7823,631.63,7191.37,255076.78999999963]
[null,null,null,null,null,null,88,"2022-08-25",7823,614.30999999999995,7208.6900000000005,247868.09999999963]
[null,null,null,null,null,null,89,"2022-09-25",7823,596.95000000000005,7226.05,240642.04999999964]
[null,null,null,null,null,null,90,"2022-10-25",7823,579.54999999999995,7243.45,233398.59999999963]
[null,null,null,null,null,null,91,"2022-11-25",7823,562.1,7260.9,226137.69999999963]
[null,null,null,null,null,null,92,"2022-12-25",7823,544.61,7278.39,218859.30999999962]
[null,null,null,null,null,null,93,"2023-01-25",7823,527.09,7295.91,211563.39999999962]
[null,null,null,null,null,null,94,"2023-02-25",7823,509.52,7313.48,204249.91999999961]
[null,null,null,null,null,null,95,"2023-03-25",7823,491.9,7331.1,196918.8199999996]
[null,null,null,null,null,null,96,"2023-04-25",7823,474.25,7348.75,189570.0699999996]
[null,null,null,null,null,null,97,"2023-05-25",7823,456.55,7366.45,182203.61999999959]
[null,null,null,null,null,null,98,"2023-06-25",7823,438.81,7384.19,174819.42999999959]
[null,null,null,null,null,null,99,"2023-07-25",7823,421.02,7401.98,167417.44999999958]
[null,null,null,null,null,null,100,"2023-08-25",7823,403.2,7419.8,159997.64999999959]
[null,null,null,null,null,null,101,"2023-09-25",7823,385.33,7437.67,152559.97999999957]
[null,null,null,null,null,null,102,"2023-10-25",7823,367.42,7455.58,145104.39999999959]
[null,null,null,null,null,null,103,"2023-11-25",7823,349.46,7473.54,137630.85999999958]
[null,null,null,null,null,null,104,"2023-12-25",7823,331.46,7491.54,130139.31999999958]
[null,null,null,null,null,null,105,"2024-01-25",7823,313.42,7509.58,122629.73999999958]
[null,null,null,null,null,null,106,"2024-02-25",7823,295.33,7527.67,115102.06999999958]
[null,null,null,null,null,null,107,"2024-03-25",7823,277.2,7545.8,107556.26999999958]
[null,null,null,null,null,null,108,"2024-04-25",7823,259.02999999999997,7563.97,99992.299999999581]
[null,null,null,null,null,null,109,"2024-05-25",7823,240.81,7582.19,92410.109999999579]
[null,null,null,null,null,null,110,"2024-06-25",7823,222.55,7600.45,84809.659999999581]
[null,null,null,null,null,null,111,"2024-07-25",7823,204.25,7618.75,77190.909999999581]
[null,null,null,null,null,null,112,"2024-08-25",7823,185.9,7637.1,69553.809999999576]
[null,null,null,null,null,null,113,"2024-09-25",7823,167.51,7655.49,61898.319999999578]
[null,null,null,null,null,null,114,"2024-10-25",7823,149.07,7673.93,54224.389999999577]
[null,null,null,null,null,null,115,"2024-11-25",7823,130.59,7692.41,46531.979999999574]
[null,null,null,null,null,null,116,"2024-12-25",7823,112.06,7710.94,38821.039999999572]
[null,null,null,null,null,null,117,"2025-01-25",7823,93.49,7729.51,31091.52999999957]
[null,null,null,null,null,null,118,"2025-02-25",7823,74.88,7748.12,23343.409999999571]
[null,null,null,null,null,null,119,"2025-03-25",7823,56.22,7766.78,15576.629999999572]
[null,null,null,null,null,null,120,"2025-04-25",7823,37.51,7785.49,7791.139999999572]
[null,null,null,null,null,null,121,"2025-05-25",7809.8999999995722,18.760000000000002,7791.139999999572,0]

{"sheet":"adminKalendar","index":8,"n_rows":15,"n_cols":3,"rows_kept":15,"cut":false,"hidden":true,"merged":[[7,1,7,2]]}
[]
[null,"FixAfter",60]
[null,"SazbaAfterFix",{"$f":"IF(SlevaCardif=\"Ano\",Sazba +0.3%,Sazba)","v":3.0000000000000001E-3}]
[null,"PocetDnivPrvnimMesici",2]
[null,"AnuitaAfterFix",{"$f":"IF(SlevaCardif=\"Ano\",ROUNDUP(PMT(SazbaAfterFix/12,PocetSpl-60,-Kalendar!L81),0),Anuita)","v":-7223}]
[]
[]
[null,"Vypočteno Dle"]
[null,"help",{"$f":"AND(Dluh=DluhLast,Sazba=SazbaLast,Kalendar!CerpaniD=CerpaniDLast,PrvniSplatka=PrvniSplatkaLast,Anuita=AnuitaLast,PocetSpl=PocetSplLast)","v":false}]
[null,"Výše úvěru",824000]
[null,"Sazba",2.3900000000000001E-2]
[null,"Poslední čerpání","2015-05-23"]
[null,"První splátka","2015-05-25"]
[null,"Anuita",7727]
[null,"Počet splátek",120]

{"sheet":"Zadost","index":9,"n_rows":315,"n_cols":53,"rows_kept":315,"cut":false,"hidden":false,"merged":[[2,0,2,12],[6,11,6,15],[6,16,6,17],[11,6,11,21],[11,29,11,40],[12,6,12,21],[12,29,12,40],[23,2,23,51],[28,2,28,16],[28,19,28,33],[28,36,28,51],[11,44,11,51],[31,2,31,16],[31,19,31,51],[14,1,14,52],[19,2,19,16],[19,19,19,33],[19,36,19,51],[21,2,21,16],[21,19,21,33],[42,2,42,51],[43,2,43,51],[52,2,52,24],[52,27,52,37],[52,40,52,51],[35,19,35,33],[35,36,35,39],[37,19,37,33],[37,36,37,51],[40,2,40,51],[41,2,41,51],[45,14,45,24],[45,2,45,11],[62,1,62,51],[63,1,63,51],[64,1,64,51],[65,1,65,51],[66,1,66,51],[67,1,67,51],[54,2,54,24],[54,27,54,51],[56,2,56,24],[56,27,56,37],[56,40,56,51],[58,2,58,24],[58,27,58,51],[81,1,81,16],[81,17,81,51],[86,6,86,21],[86,29,86,40],[87,6,87,21],[87,29,87,40],[69,1,69,51],[70,1,70,50],[73,2,73,17],[73,21,73,31],[76,1,76,21],[79,1,79,21],[98,2,98,51],[103,2,103,16],[103,19,103,33],[103,36,103,51],[106,2,106,16],[106,19,106,51],[89,1,89,52],[94,2,94,16],[94,19,94,33],[94,36,94,51],[96,2,96,16],[96,19,96,33],[117,2,117,51],[118,2,118,51],[121,2,121,24],[128,2,128,24],[128,27,128,37],[128,40,128,51],[110,19,110,33],[110,36,110,39],[112,19,112,33],[112,36,112,51],[115,2,115,51],[116,2,116,51],[145,1,145,51],[146,1,146,50],[138,1,138,51],[139,1,139,51],[140,1,140,51],[141,1,141,51],[142,1,142,51],[143,1,143,51],[130,2,130,24],[130,27,130,51],[132,2,132,24],[132,27,132,37],[132,40,132,51],[134,2,134,24],[134,27,134,51],[159,1,159,16],[159,17,159,51],[161,2,161,11],[164,6,164,21],[164,29,164,40],[165,6,165,21],[165,29,165,40],[149,2,149,17],[149,21,149,31],[153,1,153,21],[157,1,157,21],[176,2,176,51],[181,2,181,16],[181,19,181,33],[181,36,181,51],[184,2,184,16],[184,19,184,51],[167,1,167,52],[172,2,172,16],[172,19,172,33],[172,36,172,51],[174,2,174,16],[174,19,174,33],[195,2,195,51],[196,2,196,51],[199,2,199,24],[206,2,206,24],[206,27,206,37],[206,40,206,51],[188,19,188,33],[188,36,188,39],[190,19,190,33],[190,36,190,51],[193,2,193,51],[194,2,194,51],[223,1,223,51],[224,1,224,50],[216,1,216,51],[217,1,217,51],[218,1,218,51],[219,1,219,51],[220,1,220,51],[221,1,221,51],[208,2,208,24],[208,27,208,51],[210,2,210,24],[210,27,210,37],[210,40,210,51],[212,2,212,24],[212,27,212,51],[237,1,237,16],[237,17,237,52],[241,6,241,21],[241,29,241,40],[242,6,242,21],[242,29,242,40],[227,2,227,17],[227,21,227,31],[231,1,231,21],[235,1,235,21],[253,2,253,51],[258,2,258,16],[258,19,258,33],[258,36,258,51],[261,2,261,16],[261,19,261,51],[244,1,244,52],[249,2,249,16],[249,19,249,33],[249,36,249,51],[251,2,251,16],[251,19,251,33],[272,2,272,51],[273,2,273,51],[276,2,276,24],[283,2,283,24],[283,27,283,37],[283,40,283,51],[265,19,265,33],[265,36,265,39],[267,19,267,33],[267,36,267,51],[270,2,270,51],[271,2,271,51],[300,1,300,51],[301,1,301,50],[293,1,293,51],[294,1,294,51],[295,1,295,51],[296,1,296,51],[297,1,297,51],[298,1,298,51],[285,2,285,24],[285,27,285,51],[287,2,287,24],[287,27,287,37],[287,40,287,51],[289,2,289,24],[289,27,289,51],[314,1,314,16],[314,17,314,51],[316,1,316,3],[317,1,317,52],[318,1,318,3],[319,1,319,52],[304,2,304,17],[304,21,304,31],[308,1,308,21],[312,1,312,21],[328,27,329,50],[330,27,330,50],[333,27,334,50],[334,1,334,24],[335,27,335,50],[339,26,339,52],[320,1,320,52],[321,1,321,3],[322,1,322,52],[323,1,323,3],[324,1,324,52],[325,1,325,3],[387,3,387,52],[389,1,389,35],[391,3,391,10],[391,12,391,13],[391,14,391,18],[391,20,391,32],[344,1,344,52],[348,3,348,52],[367,3,367,52],[382,3,382,52],[383,3,383,52],[385,3,385,52],[427,3,427,10],[427,12,427,13],[427,14,427,18],[427,20,427,32],[428,20,428,32],[429,1,429,32],[392,20,392,32],[397,26,397,52],[419,3,419,52],[420,3,420,52],[421,3,421,52],[423,3,423,52]]}
[]
[]
["ŽÁDOST",null,null,null,null,null,null,null,null,null,null,null,null,null,null,null,null,null,null,null,null,null,null,null,null,null,null,null,null,null,null,null,null,null,null,null,null,null,null,null,null,null,null,null,null,null,null,null,null,null,null,null,{"$f":"manVerze","v":"v.14a"}]
[]
[]
[]
[null,null,null,null,null,null,null,null,null,null,null,"Počet žatadelů",null,null,null,null,1]
[]
[]
[]
[null,null,"Vyplní Banka"]
[null,null,"Pracovník banky:",null,null,null,null,null,null,null,null,null,null,null,null,null,null,null,null,null,null,null,null,null,"Číslo klienta (NDG):",null,null,null,null,null,null,null,null,null,null,null,null,null,null,null,null,null,null,"Verze:",1]
[null,null,"Pobočka (číslo):",null,null,null,null,null,null,null,null,null,null,null,null,null,null,null,null,null,null,null,null,null,"Číslo žádosti:"]
[]
[null,"ŽÁDOST O POSKYTNUTÍ HYPOTEČNÍHO ÚVĚRU"]
[null,null,"Vyplní klient"]
[null,null,"ÚDAJE O ŽADATELI/SPOLUŽADATELI* (DÁLE JEN \"ŽADATEL\")"]
[null,null,"Základní údaje"]
[null,null,"Jméno",null,null,null,null,null,null,null,null,null,null,null,null,null,null,null,null,"Příjmení",null,null,null,null,null,null,null,null,null,null,null,null,null,null,null,null,"Rodné číslo (bez lomítka)"]
[null,null,{"$f":"IF(SplatkaJmenoKlienta=0,\"\",SplatkaJmenoKlienta)","v":""},null,null,null,null,null,null,null,null,null,null,null,null,null,null,null,null,{"$f":"IF(SplPrijmeniKlienta = \"\",\"\",SplPrijmeniKlienta)","v":""}]
[null,null,"Datum narození",null,null,null,null,null,null,null,null,null,null,null,null,null,null,null,null,"Země narození (není-li ČR)",null,null,null,null,null,null,null,null,null,null,null,null,null,null,null,null,"Pohlaví",null,null,null,null,null,{"$f":"zadRC/11=INT(zadRC/11)","v":true}]
[null,null,{"$f":"IF(AQ21=TRUE,(IF(zadRC=\"\",\"\",DATE(IF(AND(LEN(zadRC)=10,MID(zadRC,1,2)*1<54),MID(zadRC,1,2)+2000,MID(zadRC,1,2)+1900),MID(zadRC,3,2)-IF(MID(zadRC,3,2)*1>12,50),MID(zadRC,5,2)))),\"Rodné číslo je zadáno chybně!\")","v":""},null,null,null,null,null,null,null,null,null,null,null,null,null,null,null,null,null,null,null,null,null,null,null,null,null,null,null,null,null,null,null,null,null,{"$f":"IF(AQ21=TRUE,(IF(zadRC=\"\",\"\",IF(MID(zadRC,3,2)*1<12,\"X\",\"\"))),\"\")","v":""},"Muž",null,{"$f":"IF(AQ21=TRUE,(IF(zadRC=\"\",\"\",IF(MID(zadRC,3,2)*1>12,\"X\",\"\"))),\"\")","v":""},"Žena"]
[null,null,"Adresa trvalého pobytu (ulice, č.p., město, PSČ, země)"]
[]
[null,null,"Doklad totožnosti"]
[null,null,"Typ dokladu"]
[null,null,null,"Občanský průkaz",null,null,null,null,null,null,"Cestovní pas",null,null,null,null,null,"Identifikační karta občana EU"]
[null,null,"Číslo dokladu",null,null,null,null,null,null,null,null,null,null,null,null,null,null,null,null,"Země vydání dokladu (není-li ČR)",null,null,null,null,null,null,null,null,null,null,null,null,null,null,null,null,"Datum vydání dokladu"]
[]
[null,null,"Kontaktní údaje"]
[null,null,"Telefon",null,null,null,null,null,null,null,null,null,null,null,null,null,null,null,null,"E-mail"]
[]
[]
[null,null,"ÚDAJE O POŽADOVANÉM  ÚVĚRU"]
[null,null,"Účel úvěru refinancování",null,null,null,null,null,null,null,null,null,null,null,null,null,null,null,null,"Celková výše úvěru v Kč**",null,null,null,null,null,null,null,null,null,null,null,null,null,null,null,null,"Počet splátek"]
[null,null,{"$f":"IF(HlavUcelUveru=\"Refinancování úvěru - zjednodušené\",\"X\",IF(HlavUcelUveru=\"Refinancování úvěru - standard\",\"X\",\"\"))","v":""},"Ano",null,null,{"$f":"IF(zadUcelUveru1=\"X\",\"\",\"X\")","v":"X"},"Ne",null,null,null,null,null,null,null,null,null,null,null,{"$f":"IF(SlevaCardif=\"Ano\",(IF(VyseUveru=0,\"\",VyseUveru)),(IF(VyseUveruZaklad+vyseUveru2=0,\"\",VyseUveruZaklad+vyseUveru2)))","v":2060000},null,null,null,null,null,null,null,null,null,null,null,null,null,null,null,null,{"$f":"DobaSplatnosti*12","v":300}]
[null,null,"Úvěr v kombinaci s neúčelovou částí***",null,null,null,null,null,null,null,null,null,null,null,null,null,null,null,null,"Výše účelové části v Kč",null,null,null,null,null,null,null,null,null,null,null,null,null,null,null,null,"Výše neúčelové části v Kč"]
[null,null,{"$f":"IF(TypHypoteky=\"Hypoteční úvěr účelový rezidenční Twin\",\"X\",\"\")","v":""},"Ano",null,null,{"$f":"IF(TypHypoteky<>\"Hypoteční úvěr účelový rezidenční Twin\",\"X\",\"\")","v":"X"},"Ne",null,null,null,null,null,null,null,null,null,null,null,{"$f":"IF(zadUverVKomb2=\"x\",\"\",VyseUveruZaklad)","v":""},null,null,null,null,null,null,null,null,null,null,null,null,null,null,null,null,{"$f":"IF(zadUverVKomb2=\"x\",\"\",vyseUveru2)","v":""}]
[]
[null,null,"PROHLÁŠENÍ ŽADATELE "]
[null,null,"Žadatel prohlašuje, že veškeré údaje uvedené v této žádosti o poskytnutí úvěru, resp. v dokumentech přiložených, jsou úplné a odpovídají skutečnosti a že nezamlčel žádnou relevantní skutečnost, která by mohla ovlivnit rozhodnutí UniCredit Bank Czech Republic and Slovakia, a.s. (dále jen „Banka“) při poskytnutí úvěru. \n\n\n\n"]
[null,null,"Dále Žadatel prohlašuje, že je plně svéprávný a že ke dni podání této žádosti o poskytnutí úvěru není v prodlení vůči státu nebo jinému subjektu s úhradou daní či poplatků, úhradou pojistného na sociální zabezpečení, zdravotní pojištění, úhradou cla nebo jiných povinných plateb."]
[null,null,"Žadatel souhlasí s tím, aby Banka získala informace o jeho bonitě (zahrnující zejména informaci o povaze a rozsahu případného porušení dřívějších závazků), platební morálce a důvěryhodnosti, které jsou nutné k posouzení žádosti o poskytnutí úvěru, a to z registrů sdružení SOLUS (www.solus.cz), jehož je Banka členem.\n"]
[null,null,"Žadatel potvrzuje, že se seznámil s \"Poučením o zpracování osobních údajů podle § 11 zákona č. 101/2000 Sb., o ochraně osobních údajů\", které je k dispozici mj. na webových stránkách a pobočkách Banky, zejména výslovně bere na vědomí, že Banka může jeho osobní údaje zpracovávat i prostřednictvím zpracovatelů se sídlem v členských státech Evropské unie, zejm. UniCredit Business Integrated Solutions S.C.p.A., Itálie. Veškerá místa, na kterých dochází ke zpracování osobních údajů Bankou nebo zpracovateli Banky, jsou nahlášena jako místa zpracování osobních údajů u Úřadu pro ochranu osobních údajů."]
[null,null,"Místo:",null,null,null,null,null,null,null,null,null,null,null,"Datum:"]
[]
[null,null,null,null,null,null,null,null,null,null,null,null,null,null,null,null,null,null,null,null,null,null,null,null,null,null,null,"Podpis Žadatele"]
[null,null,"* Nehodící se škrtněte"]
[null,null,"** Včetně všech nákladů, které budou z úvěru hrazeny (životní pojištění, poplatky atd.)"]
[null,null,"*** Hypoteční úvěr Twin (rezidenční hypoteční úvěr kombinovaný s neúčelovou částí)"]
[null,null,"Vyplní Banka / Pověřený zástupce Banky / Třetí strana - rozdělit"]
[null,null,"Totožnost ověřil (jméno, příjmení):",null,null,null,null,null,null,null,null,null,null,null,null,null,null,null,null,null,null,null,null,null,null,null,null,"Dne:",null,null,null,null,null,null,null,null,null,null,null,null,"Podpis:"]
[]
[null,null,"Název (jméno) 3P:",null,null,null,null,null,null,null,null,null,null,null,null,null,null,null,null,null,null,null,null,null,null,null,null,"Jméno a příjmení makléře:"]
[]
[null,null,"Přidělené ID 3P:",null,null,null,null,null,null,null,null,null,null,null,null,null,null,null,null,null,null,null,null,null,null,null,null,"IČ (popř. RČ) makléře",null,null,null,null,null,null,null,null,null,null,null,null,"Evid. č. makléře"]
[]
[null,null,"Telefon makléře:",null,null,null,null,null,null,null,null,null,null,null,null,null,null,null,null,null,null,null,null,null,null,null,null,"E-mail makléře:"]
[]
[]
[]
[null,"SOUHLAS se zpracováním osobních údajů a použitím rodného čísla"]
[null,"V souvislosti s uzavřením/žádostí o uzavření smlouvy mezi mnou a UniCredit Bank Czech Republic and Slovakia, a.s. (dále jen „Smlouva“ a „Banka“) souhlasím s tím, aby Banka za níže uvedeným účelem shromažďovala, zpracovávala a uchovávala mé osobní údaje, tj. jméno, příjmení, datum narození, rodné číslo, adresu, údaje o identifikačním dokladu a IČ (dále jen „osobní údaje“), a to způsobem, a za podmínek uvedených v Informačním Memorandu Bankovního registru klientských informací a Nebankovního registru klientských informací (dále jen „Informační Memorandum“) a v Poučení o registrech Sdružení SOLUS (též jen „Poučení“)."]
[null,"Dále souhlasím, aby Banka mé osobní údaje předávala Sdružení SOLUS k dalšímu zpracování v „Pozitivním registru sdružení SOLUS“ (též jen „Pozitivní registr“) a v Registru FO Sdružení SOLUS (též jen „Registr FO“) k dalšímu shromažďování, zpracovávání a uchovávání. Souhlasím, aby Sdružení SOLUS vytvořilo informační soubor mých osobních údajů od všech členských bank, případně též společně s dalšími mými veřejně dostupnými osobními údaji (např. mé osobní údaje obsažené v Insolvenčním rejstříku), a v rámci tohoto informačního souboru mých osobních údajů provádělo statistická vyhodnocení mé bonity a důvěryhodnosti. Souhlasím, aby Sdružení SOLUS mé osobní údaje (ve formě informačního souboru včetně údajů o statistických vyhodnoceních mé bonity a důvěryhodnosti) zpřístupnilo formou on-line dotazů všem oprávněným uživatelům (členům sdružení SOLUS) Pozitivního registru a Registru FO, tedy i Bance, a to vždy v rozsahu a za podmínek uvedeném pro každý z těchto registrů v Poučení."]
[null,"Souhlasím, aby Banka i opakovaně získávala informace o mé bonitě, platební morálce a důvěryhodnosti z Pozitivního registru a Registru FO. Souhlasím, aby všichni oprávnění uživatelé Pozitivního registru anebo Registru FO, kterým byly zpřístupněny mé osobní údaje, tyto používali, a to případně spolu s dalšími mými osobními údaji, jež oprávněně zpracovávají."]
[null,"Účelem zpracování osobních údajů v Pozitivním registru a Registru FO je splnění povinnosti odpovědného poskytování úvěrů a jiných obchodů Banky, zajištění vzájemného informování oprávněných uživatelů Pozitivního registru a Registru FO o mé bonitě, důvěryhodnosti a platební morálce, posuzování mé bonity, důvěryhodnosti a platební morálky ze strany oprávněných uživatelů Pozitivního registru a Registru FO, a to i opakovaně, jakož i ochrana práv Banky a ostatních členů sdružení SOLUS. Kromě předešlého je účelem zpracování mých osobních údajů na základě tohoto souhlasu rovněž zajištění vzájemného informování oprávněných uživatelů Bankovního registru klientských informací (dále jen „BRKI“) a Nebankovního registru klientských informací (dále jen „NRKI“) o mé bonitě, důvěryhodnosti a platební morálce a umožnění (a to i opakovaného) posuzování mé bonity, důvěryhodnosti a platební morálky ze strany oprávněných uživatelů BRKI a NRKI. Způsob, rozsah a podmínky vzájemného informování oprávněných uživatelů BRKI a NRKI jsou uvedeny v Informačním Memorandu."]
[null,"Souhlas uděluji na dobu 4 let ode dne jeho udělení. V případě, že mezi mnou [nebo žadatelem, pokud jde o ručitele, spolužadatele nebo zákonného zástupce] a Bankou byla nebo bude uzavřena Smlouva, uděluji tento souhlas na dobu jejího trvání a na dobu dalších 4 let od splnění veškerých mých finančních závazků z uzavřené Smlouvy, pokud tyto závazky zaniknou splněním nebo způsobem nahrazujícím splnění, resp. od zániku Smlouvy, pokud finanční závazky ze Smlouvy zaniknou jinak. "]
[null,"Před podpisem tohoto souhlasu jsem se seznámil(a) s Informačním Memorandem, které obsahuje i poučení o mých právech v souvislosti se zpracováním mých osobních údajů v rámci BRKI i pro účely vzájemného informování se uživatelů BRKI a/nebo NRKI o bonitě, důvěryhodnosti či platební morálce jejich klientů. Před podpisem tohoto souhlasu jsem rovněž byl(a) informován(a), že aktuální znění Informačního Memoranda mohu kdykoli získat na informační lince, pobočkách a na webových stránkách banky www.unicreditbank.cz nebo na informační lince a webových stránkách provozovatele registru www.cbcb.cz."]
[]
[null,"Dále prohlašuji, že jsem se seznámil(a) s  dokumentem \"POUČENÍ o registrech Sdružení SOLUS\", jehož obsahem je: (i) vysvětlení pojmu informační soubor, a to zvlášť pro Pozitivní registr a Registr FO, (ii) definice dalších mých osobních údajů, které mohou vzniknout při zpracování, (iii) popis fungování Pozitivního registru a Registru FO, (iv) identifikace subjektů či osob, které mohou mít přístup k mým osobním údajům při jejich zpracování  a (v) poučení o mých právech (§ 11 a § 12 zákona o ochraně osobních údajů č. 101/2000 Sb.) a nárocích (§ 21 zákona č. 101/2000 Sb.) v souvislosti se zpracováním mých osobních údajů v rámci pozitivního registru SOLUS. Byl(a) jsem informován(a), že aktuální znění Poučení mohu kdykoli získat na informační lince, pobočkách a webových stránkách banky www.unicreditbank.cz nebo na informační lince a webových stránkách sdružení SOLUS www.solus.cz."]
[null,"Potvrzuji, že jsem byl(a) Bankou poučen(a) o svých nárocích vůči porušiteli dle § 21 zákona č. 101/2000 Sb. "]
[null,"Po uzavření Smlouvy s Bankou se tento souhlas stává její nedílnou součástí."]
[]
[null,"V",null,null,null,null,null,null,null,null,null,null,null,null,null,null,null,null,null,"dne"]
[]
[]
[null,"Podpis žadatele"]
[]
[]
[null,"Podpis spolužadatele"]
[]
[null,"Jméno a podpis zástupce banky, který podpis/y ověřil:"]
[]
[]
[]
[null,null,"Vyplní Banka"]
[null,null,"Pracovník banky:",null,null,null,{"$f":"IF(zPracovnikBanky=\"\",\"\",zPracovnikBanky)","v":""},null,null,null,null,null,null,null,null,null,null,null,null,null,null,null,null,null,"Číslo klienta (NDG):",null,null,null,null,{"$f":"IF(zNdg=\"\",\"\",zNdg)","v":""}]
[null,null,"Pobočka (číslo):",null,null,null,{"$f":"IF(zPobocka=\"\",\"\",zPobocka)","v":""},null,null,null,null,null,null,null,null,null,null,null,null,null,null,null,null,null,"Číslo žádosti:",null,null,null,null,{"$f":"IF(zCisloZadosti=\"\",\"\",zCisloZadosti)","v":""}]
[]
[null,"ŽÁDOST O POSKYTNUTÍ HYPOTEČNÍHO ÚVĚRU"]
[null,null,"Vyplní klient"]
[null,null,"ÚDAJE O ŽADATELI/SPOLUŽADATELI* (DÁLE JEN \"ŽADATEL\")"]
[null,null,"Základní údaje"]
[null,null,"Jméno",null,null,null,null,null,null,null,null,null,null,null,null,null,null,null,null,"Příjmení",null,null,null,null,null,null,null,null,null,null,null,null,null,null,null,null,"Rodné číslo (bez lomítka)"]
[]
[null,null,"Datum narození",null,null,null,null,null,null,null,null,null,null,null,null,null,null,null,null,"Země narození (není-li ČR)",null,null,null,null,null,null,null,null,null,null,null,null,null,null,null,null,"Pohlaví",null,null,null,null,{"$f":"zadRC/11=INT(zadRC/11)","v":true}]
[null,null,{"$f":"IF(AP96=TRUE,(IF(zadRC2=\"\",\"\",DATE(IF(AND(LEN(zadRC2)=10,MID(zadRC2,1,2)*1<54),MID(zadRC2,1,2)+2000,MID(zadRC2,1,2)+1900),MID(zadRC2,3,2)-IF(MID(zadRC2,3,2)*1>12,50),MID(zadRC2,5,2)))),\"Rodné číslo je zadáno chybně!\")","v":""},null,null,null,null,null,null,null,null,null,null,null,null,null,null,null,null,null,null,null,null,null,null,null,null,null,null,null,null,null,null,null,null,null,{"$f":"IF(AP96=TRUE,(IF(zadRC2=\"\",\"\",IF(MID(zadRC2,3,2)*1<12,\"X\",\"\"))),\"\")","v":""},"Muž",null,{"$f":"IF(AP96=TRUE,(IF(zadRC2=\"\",\"\",IF(MID(zadRC2,3,2)*1>12,\"X\",\"\"))),\"\")","v":""},"Žena"]
[null,null,"Adresa trvalého pobytu (ulice, č.p., město, PSČ, země)"]
[]
[null,null,"Doklad totožnosti"]
[null,null,"Typ dokladu"]
[null,null,null,"Občanský průkaz",null,null,null,null,null,null,"Cestovní pas",null,null,null,null,null,"Identifikační karta občana EU"]
[null,null,"Číslo dokladu",null,null,null,null,null,null,null,null,null,null,null,null,null,null,null,null,"Země vydání dokladu (není-li ČR)",null,null,null,null,null,null,null,null,null,null,null,null,null,null,null,null,"Datum vydání dokladu"]
[]
[null,null,"Kontaktní údaje"]
[null,null,"Telefon",null,null,null,null,null,null,null,null,null,null,null,null,null,null,null,null,"E-mail"]
[]
[]
[null,null,"ÚDAJE O POŽADOVANÉM  ÚVĚRU"]
[null,null,"Účel úvěru refinancování",null,null,null,null,null,null,null,null,null,null,null,null,null,null,null,null,"Celková výše úvěru v Kč**",null,null,null,null,null,null,null,null,null,null,null,null,null,null,null,null,"Počet splátek"]
[null,null,{"$f":"IF(HlavUcelUveru=\"Refinancování úvěru - zjednodušené\",\"X\",IF(HlavUcelUveru=\"Refinancování úvěru - standard\",\"X\",\"\"))","v":""},"Ano",null,null,{"$f":"IF(zadUcelUveru21=\"X\",\"\",\"X\")","v":"X"},"Ne",null,null,null,null,null,null,null,null,null,null,null,{"$f":"IF(SlevaCardif=\"Ano\",(IF(VyseUveru=0,\"\",VyseUveru)),(IF(VyseUveruZaklad+vyseUveru2=0,\"\",VyseUveruZaklad+vyseUveru2)))","v":2060000},null,null,null,null,null,null,null,null,null,null,null,null,null,null,null,null,{"$f":"DobaSplatnosti*12","v":300}]
[null,null,"Úvěr v kombinaci s neúčelovou částí***",null,null,null,null,null,null,null,null,null,null,null,null,null,null,null,null,"Výše účelové části v Kč",null,null,null,null,null,null,null,null,null,null,null,null,null,null,null,null,"Výše neúčelové části v Kč"]
[null,null,{"$f":"IF(TypHypoteky=\"Hypoteční úvěr účelový rezidenční Twin\",\"X\",\"\")","v":""},"Ano",null,null,{"$f":"IF(TypHypoteky<>\"Hypoteční úvěr účelový rezidenční Twin\",\"X\",\"\")","v":"X"},"Ne",null,null,null,null,null,null,null,null,null,null,null,{"$f":"IF(zadUverVKomb22=\"x\",\"\",VyseUveruZaklad)","v":""},null,null,null,null,null,null,null,null,null,null,null,null,null,null,null,null,{"$f":"IF(zadUverVKomb22=\"x\",\"\",vyseUveru2)","v":""}]
[]
[null,null,"PROHLÁŠENÍ ŽADATELE "]
[null,null,"Žadatel prohlašuje, že veškeré údaje uvedené v této žádosti o poskytnutí úvěru, resp. v dokumentech přiložených, jsou úplné a odpovídají skutečnosti a že nezamlčel žádnou relevantní skutečnost, která by mohla ovlivnit rozhodnutí UniCredit Bank Czech Republic and Slovakia, a.s. (dále jen „Banka“) při poskytnutí úvěru. \n\n\n\n"]
[null,null,"Dále Žadatel prohlašuje, že je plně svéprávný a že ke dni podání této žádosti o poskytnutí úvěru není v prodlení vůči státu nebo jinému subjektu s úhradou daní či poplatků, úhradou pojistného na sociální zabezpečení, zdravotní pojištění, úhradou cla nebo jiných povinných plateb."]
[null,null,"Žadatel souhlasí s tím, aby Banka získala informace o jeho bonitě (zahrnující zejména informaci o povaze a rozsahu případného porušení dřívějších závazků), platební morálce a důvěryhodnosti, které jsou nutné k posouzení žádosti o poskytnutí úvěru, a to z registrů sdružení SOLUS (www.solus.cz), jehož je Banka členem.\n"]
[null,null,"Žadatel potvrzuje, že se seznámil s \"Poučením o zpracování osobních údajů podle § 11 zákona č. 101/2000 Sb., o ochraně osobních údajů\", které je k dispozici mj. na webových stránkách a pobočkách Banky, zejména výslovně bere na vědomí, že Banka může jeho osobní údaje zpracovávat i prostřednictvím zpracovatelů se sídlem v členských státech Evropské unie, zejm. UniCredit Business Integrated Solutions S.C.p.A., Itálie. Veškerá místa, na kterých dochází ke zpracování osobních údajů Bankou nebo zpracovateli Banky, jsou nahlášena jako místa zpracování osobních údajů u Úřadu pro ochranu osobních údajů."]
[]
[]
[]
[null,null,"Místo, datum",null,null,null,null,null,null,null,null,null,null,null,null,null,null,null,null,null,null,null,null,null,null,null,null,"Podpis Žadatele"]
[null,null,"* Nehodící se škrtněte"]
[null,null,"** Včetně všech nákladů, které budou z úvěru hrazeny (životní pojištění, poplatky atd.)"]
[null,null,"*** Hypoteční úvěr Twin (rezidenční hypoteční úvěr kombinovaný s neúčelovou částí)"]
[null,null,"Vyplní Banka / Pověřený zástupce Banky / Třetí strana - rozdělit"]
[null,null,"Totožnost ověřil (jméno, příjmení):",null,null,null,null,null,null,null,null,null,null,null,null,null,null,null,null,null,null,null,null,null,null,null,null,"Dne:",null,null,null,null,null,null,null,null,null,null,null,null,"Podpis:"]
[null,null,{"$f":"IF(zTotoznostOveril=\"\",\"\",zTotoznostOveril)","v":""},null,null,null,null,null,null,null,null,null,null,null,null,null,null,null,null,null,null,null,null,null,null,null,null,{"$f":"IF(zDne=\"\",\"\",zDne)","v":""}]
[null,null,"Název (jméno) 3P:",null,null,null,null,null,null,null,null,null,null,null,null,null,null,null,null,null,null,null,null,null,null,null,null,"Jméno a příjmení makléře:"]
[null,null,{"$f":"IF(zNazev3p=\"\",\"\",zNazev3p)","v":""},null,null,null,null,null,null,null,null,null,null,null,null,null,null,null,null,null,null,null,null,null,null,null,null,{"$f":"IF(zJmenoPrijmeni=\"\",\"\",zJmenoPrijmeni)","v":""}]
[null,null,"Přidělené ID 3P:",null,null,null,null,null,null,null,null,null,null,null,null,null,null,null,null,null,null,null,null,null,null,null,null,"IČ (popř. RČ) makléře",null,null,null,null,null,null,null,null,null,null,null,null,"Evid. č. makléře"]
[null,null,{"$f":"IF(zPrideleneId=\"\",\"\",zPrideleneId)","v":""},null,null,null,null,null,null,null,null,null,null,null,null,null,null,null,null,null,null,null,null,null,null,null,null,{"$f":"IF(zIcMaklere=\"\",\"\",zIcMaklere)","v":""},null,null,null,null,null,null,null,null,null,null,null,null,{"$f":"IF(zEvidMaklere=\"\",\"\",zEvidMaklere)","v":""}]
[null,null,"Telefon makléře:",null,null,null,null,null,null,null,null,null,null,null,null,null,null,null,null,null,null,null,null,null,null,null,null,"E-mail makléře:"]
[null,null,{"$f":"IF(zTelefonMaklere=\"\",\"\",zTelefonMaklere)","v":""},null,null,null,null,null,null,null,null,null,null,null,null,null,null,null,null,null,null,null,null,null,null,null,null,{"$f":"IF(zEmailMaklere=\"\",\"\",zEmailMaklere)","v":""}]
[]
[]
[null,"SOUHLAS se zpracováním osobních údajů a použitím rodného čísla"]
[null,"V souvislosti s uzavřením/žádostí o uzavření smlouvy mezi mnou a UniCredit Bank Czech Republic and Slovakia, a.s. (dále jen „Smlouva“ a „Banka“) souhlasím s tím, aby Banka za níže uvedeným účelem shromažďovala, zpracovávala a uchovávala mé osobní údaje, tj. jméno, příjmení, datum narození, rodné číslo, adresu, údaje o identifikačním dokladu a IČ (dále jen „osobní údaje“), a to způsobem, a za podmínek uvedených v Informačním Memorandu Bankovního registru klientských informací a Nebankovního registru klientských informací (dále jen „Informační Memorandum“) a v Poučení o registrech Sdružení SOLUS (též jen „Poučení“)."]
[null,"Dále souhlasím, aby Banka mé osobní údaje předávala Sdružení SOLUS k dalšímu zpracování v „Pozitivním registru sdružení SOLUS“ (též jen „Pozitivní registr“) a v Registru FO Sdružení SOLUS (též jen „Registr FO“) k dalšímu shromažďování, zpracovávání a uchovávání. Souhlasím, aby Sdružení SOLUS vytvořilo informační soubor mých osobních údajů od všech členských bank, případně též společně s dalšími mými veřejně dostupnými osobními údaji (např. mé osobní údaje obsažené v Insolvenčním rejstříku), a v rámci tohoto informačního souboru mých osobních údajů provádělo statistická vyhodnocení mé bonity a důvěryhodnosti. Souhlasím, aby Sdružení SOLUS mé osobní údaje (ve formě informačního souboru včetně údajů o statistických vyhodnoceních mé bonity a důvěryhodnosti) zpřístupnilo formou on-line dotazů všem oprávněným uživatelům (členům sdružení SOLUS) Pozitivního registru a Registru FO, tedy i Bance, a to vždy v rozsahu a za podmínek uvedeném pro každý z těchto registrů v Poučení."]
[null,"Souhlasím, aby Banka i opakovaně získávala informace o mé bonitě, platební morálce a důvěryhodnosti z Pozitivního registru a Registru FO. Souhlasím, aby všichni oprávnění uživatelé Pozitivního registru anebo Registru FO, kterým byly zpřístupněny mé osobní údaje, tyto používali, a to případně spolu s dalšími mými osobními údaji, jež oprávněně zpracovávají."]
[null,"Účelem zpracování osobních údajů v Pozitivním registru a Registru FO je splnění povinnosti odpovědného poskytování úvěrů a jiných obchodů Banky, zajištění vzájemného informování oprávněných uživatelů Pozitivního registru a Registru FO o mé bonitě, důvěryhodnosti a platební morálce, posuzování mé bonity, důvěryhodnosti a platební morálky ze strany oprávněných uživatelů Pozitivního registru a Registru FO, a to i opakovaně, jakož i ochrana práv Banky a ostatních členů sdružení SOLUS. Kromě předešlého je účelem zpracování mých osobních údajů na základě tohoto souhlasu rovněž zajištění vzájemného informování oprávněných uživatelů Bankovního registru klientských informací (dále jen „BRKI“) a Nebankovního registru klientských informací (dále jen „NRKI“) o mé bonitě, důvěryhodnosti a platební morálce a umožnění (a to i opakovaného) posuzování mé bonity, důvěryhodnosti a platební morálky ze strany oprávněných uživatelů BRKI a NRKI. Způsob, rozsah a podmínky vzájemného informování oprávněných uživatelů BRKI a NRKI jsou uvedeny v Informačním Memorandu."]
[null,"Souhlas uděluji na dobu 4 let ode dne jeho udělení. V případě, že mezi mnou [nebo žadatelem, pokud jde o ručitele, spolužadatele nebo zákonného zástupce] a Bankou byla nebo bude uzavřena Smlouva, uděluji tento souhlas na dobu jejího trvání a na dobu dalších 4 let od splnění veškerých mých finančních závazků z uzavřené Smlouvy, pokud tyto závazky zaniknou splněním nebo způsobem nahrazujícím splnění, resp. od zániku Smlouvy, pokud finanční závazky ze Smlouvy zaniknou jinak. "]
[null,"Před podpisem tohoto souhlasu jsem se seznámil(a) s Informačním Memorandem, které obsahuje i poučení o mých právech v souvislosti se zpracováním mých osobních údajů v rámci BRKI i pro účely vzájemného informování se uživatelů BRKI a/nebo NRKI o bonitě, důvěryhodnosti či platební morálce jejich klientů. Před podpisem tohoto souhlasu jsem rovněž byl(a) informován(a), že aktuální znění Informačního Memoranda mohu kdykoli získat na informační lince, pobočkách a na webových stránkách banky www.unicreditbank.cz nebo na informační lince a webových stránkách provozovatele registru www.cbcb.cz."]
[]
[null,"Dále prohlašuji, že jsem se seznámil(a) s  dokumentem \"POUČENÍ o registrech Sdružení SOLUS\", jehož obsahem je: (i) vysvětlení pojmu informační soubor, a to zvlášť pro Pozitivní registr a Registr FO, (ii) definice dalších mých osobních údajů, které mohou vzniknout při zpracování, (iii) popis fungování Pozitivního registru a Registru FO, (iv) identifikace subjektů či osob, které mohou mít přístup k mým osobním údajům při jejich zpracování  a (v) poučení o mých právech (§ 11 a § 12 zákona o ochraně osobních údajů č. 101/2000 Sb.) a nárocích (§ 21 zákona č. 101/2000 Sb.) v souvislosti se zpracováním mých osobních údajů v rámci pozitivního registru SOLUS. Byl(a) jsem informován(a), že aktuální znění Poučení mohu kdykoli získat na informační lince, pobočkách a webových stránkách banky www.unicreditbank.cz nebo na informační lince a webových stránkách sdružení SOLUS www.solus.cz."]
[null,"Potvrzuji, že jsem byl(a) Bankou poučen(a) o svých nárocích vůči porušiteli dle § 21 zákona č. 101/2000 Sb. "]
[null,"Po uzavření Smlouvy s Bankou se tento souhlas stává její nedílnou součástí."]
[]
[null,"V",null,null,null,null,null,null,null,null,null,null,null,null,null,null,null,null,null,"dne"]
[]
[]
[]
[null,"Podpis žadatele"]
[]
[]
[]
[null,"Podpis spolužadatele"]
[]
[null,"Jméno a podpis zástupce banky, který podpis/y ověřil:"]
[]
[]
[]
[null,null,"Vyplní Banka"]
[null,null,"Pracovník banky:",null,null,null,{"$f":"IF(zPracovnikBanky=\"\",\"\",zPracovnikBanky)","v":""},null,null,null,null,null,null,null,null,null,null,null,null,null,null,null,null,null,"Číslo klienta (NDG):",null,null,null,null,{"$f":"IF(zNdg=\"\",\"\",zNdg)","v":""}]
[null,null,"Pobočka (číslo):",null,null,null,{"$f":"IF(zPobocka=\"\",\"\",zPobocka)","v":""},null,null,null,null,null,null,null,null,null,null,null,null,null,null,null,null,null,"Číslo žádosti:",null,null,null,null,{"$f":"IF(zCisloZadosti=\"\",\"\",zCisloZadosti)","v":""}]
[]
[null,"ŽÁDOST O POSKYTNUTÍ HYPOTEČNÍHO ÚVĚRU"]
[null,null,"Vyplní klient"]
[null,null,"ÚDAJE O ŽADATELI/SPOLUŽADATELI* (DÁLE JEN \"ŽADATEL\")"]
[null,null,"Základní údaje"]
[null,null,"Jméno",null,null,null,null,null,null,null,null,null,null,null,null,null,null,null,null,"Příjmení",null,null,null,null,null,null,null,null,null,null,null,null,null,null,null,null,"Rodné číslo (bez lomítka)"]
[]
[null,null,"Datum narození",null,null,null,null,null,null,null,null,null,null,null,null,null,null,null,null,"Země narození (není-li ČR)",null,null,null,null,null,null,null,null,null,null,null,null,null,null,null,null,"Pohlaví",null,null,null,null,{"$f":"zadRC3/11=INT(zadRC3/11)","v":true}]
[null,null,{"$f":"IF(AP174=TRUE,(IF(zadRC3=\"\",\"\",DATE(IF(AND(LEN(zadRC3)=10,MID(zadRC3,1,2)*1<54),MID(zadRC3,1,2)+2000,MID(zadRC3,1,2)+1900),MID(zadRC3,3,2)-IF(MID(zadRC3,3,2)*1>12,50),MID(zadRC3,5,2)))),\"Rodné číslo je zadáno chybně!\")","v":""},null,null,null,null,null,null,null,null,null,null,null,null,null,null,null,null,null,null,null,null,null,null,null,null,null,null,null,null,null,null,null,null,null,{"$f":"IF(AP174=TRUE,(IF(zadRC3=\"\",\"\",IF(MID(zadRC3,3,2)*1<12,\"X\",\"\"))),\"\")","v":""},"Muž",null,{"$f":"IF(AP174=TRUE,(IF(zadRC3=\"\",\"\",IF(MID(zadRC3,3,2)*1>12,\"X\",\"\"))),\"\")","v":""},"Žena"]
[null,null,"Adresa trvalého pobytu (ulice, č.p., město, PSČ, země)"]
[]
[null,null,"Doklad totožnosti"]
[null,null,"Typ dokladu"]
[null,null,null,"Občanský průkaz",null,null,null,null,null,null,"Cestovní pas",null,null,null,null,null,"Identifikační karta občana EU"]
[null,null,"Číslo dokladu",null,null,null,null,null,null,null,null,null,null,null,null,null,null,null,null,"Země vydání dokladu (není-li ČR)",null,null,null,null,null,null,null,null,null,null,null,null,null,null,null,null,"Datum vydání dokladu"]
[]
[null,null,"Kontaktní údaje"]
[null,null,"Telefon",null,null,null,null,null,null,null,null,null,null,null,null,null,null,null,null,"E-mail"]
[]
[]
[null,null,"ÚDAJE O POŽADOVANÉM  ÚVĚRU"]
[null,null,"Účel úvěru refinancování",null,null,null,null,null,null,null,null,null,null,null,null,null,null,null,null,"Celková výše úvěru v Kč**",null,null,null,null,null,null,null,null,null,null,null,null,null,null,null,null,"Počet splátek"]
[null,null,{"$f":"IF(HlavUcelUveru=\"Refinancování úvěru - zjednodušené\",\"X\",IF(HlavUcelUveru=\"Refinancování úvěru - standard\",\"X\",\"\"))","v":""},"Ano",null,null,{"$f":"IF(bunka=\"X\",\"\",\"X\")","v":"X"},"Ne",null,null,null,null,null,null,null,null,null,null,null,{"$f":"IF(SlevaCardif=\"Ano\",(IF(VyseUveru=0,\"\",VyseUveru)),(IF(VyseUveruZaklad+vyseUveru2=0,\"\",VyseUveruZaklad+vyseUveru2)))","v":2060000},null,null,null,null,null,null,null,null,null,null,null,null,null,null,null,null,{"$f":"DobaSplatnosti*12","v":300}]
[null,null,"Úvěr v kombinaci s neúčelovou částí***",null,null,null,null,null,null,null,null,null,null,null,null,null,null,null,null,"Výše účelové části v Kč",null,null,null,null,null,null,null,null,null,null,null,null,null,null,null,null,"Výše neúčelové části v Kč"]
[null,null,{"$f":"IF(TypHypoteky=\"Hypoteční úvěr účelový rezidenční Twin\",\"X\",\"\")","v":""},"Ano",null,null,{"$f":"IF(TypHypoteky<>\"Hypoteční úvěr účelový rezidenční Twin\",\"X\",\"\")","v":"X"},"Ne",null,null,null,null,null,null,null,null,null,null,null,{"$f":"IF(zadUverVKomb32=\"x\",\"\",VyseUveruZaklad)","v":""},null,null,null,null,null,null,null,null,null,null,null,null,null,null,null,null,{"$f":"IF(zadUverVKomb32=\"x\",\"\",vyseUveru2)","v":""}]
[]
[null,null,"PROHLÁŠENÍ ŽADATELE "]
[null,null,"Žadatel prohlašuje, že veškeré údaje uvedené v této žádosti o poskytnutí úvěru, resp. v dokumentech přiložených, jsou úplné a odpovídají skutečnosti a že nezamlčel žádnou relevantní skutečnost, která by mohla ovlivnit rozhodnutí UniCredit Bank Czech Republic and Slovakia, a.s. (dále jen „Banka“) při poskytnutí úvěru. \n\n\n\n"]
[null,null,"Dále Žadatel prohlašuje, že je plně svéprávný a že ke dni podání této žádosti o poskytnutí úvěru není v prodlení vůči státu nebo jinému subjektu s úhradou daní či poplatků, úhradou pojistného na sociální zabezpečení, zdravotní pojištění, úhradou cla nebo jiných povinných plateb."]
[null,null,"Žadatel souhlasí s tím, aby Banka získala informace o jeho bonitě (zahrnující zejména informaci o povaze a rozsahu případného porušení dřívějších závazků), platební morálce a důvěryhodnosti, které jsou nutné k posouzení žádosti o poskytnutí úvěru, a to z registrů sdružení SOLUS (www.solus.cz), jehož je Banka členem.\n"]
[null,null,"Žadatel potvrzuje, že se seznámil s \"Poučením o zpracování osobních údajů podle § 11 zákona č. 101/2000 Sb., o ochraně osobních údajů\", které je k dispozici mj. na webových stránkách a pobočkách Banky, zejména výslovně bere na vědomí, že Banka může jeho osobní údaje zpracovávat i prostřednictvím zpracovatelů se sídlem v členských státech Evropské unie, zejm. UniCredit Business Integrated Solutions S.C.p.A., Itálie. Veškerá místa, na kterých dochází ke zpracování osobních údajů Bankou nebo zpracovateli Banky, jsou nahlášena jako místa zpracování osobních údajů u Úřadu pro ochranu osobních údajů."]
[]
[]
[]
[null,null,"Místo, datum",null,null,null,null,null,null,null,null,null,null,null,null,null,null,null,null,null,null,null,null,null,null,null,null,"Podpis Žadatele"]
[null,null,"* Nehodící se škrtněte"]
[null,null,"** Včetně všech nákladů, které budou z úvěru hrazeny (životní pojištění, poplatky atd.)"]
[null,null,"*** Hypoteční úvěr Twin (rezidenční hypoteční úvěr kombinovaný s neúčelovou částí)"]
[null,null,"Vyplní Banka / Pověřený zástupce Banky / Třetí strana - rozdělit"]
[null,null,"Totožnost ověřil (jméno, příjmení):",null,null,null,null,null,null,null,null,null,null,null,null,null,null,null,null,null,null,null,null,null,null,null,null,"Dne:",null,null,null,null,null,null,null,null,null,null,null,null,"Podpis:"]
[null,null,{"$f":"IF(zTotoznostOveril=\"\",\"\",zTotoznostOveril)","v":""},null,null,null,null,null,null,null,null,null,null,null,null,null,null,null,null,null,null,null,null,null,null,null,null,{"$f":"IF(zDne=\"\",\"\",zDne)","v":""}]
[null,null,"Název (jméno) 3P:",null,null,null,null,null,null,null,null,null,null,null,null,null,null,null,null,null,null,null,null,null,null,null,null,"Jméno a příjmení makléře:"]
[null,null,{"$f":"IF(zNazev3p=\"\",\"\",zNazev3p)","v":""},null,null,null,null,null,null,null,null,null,null,null,null,null,null,null,null,null,null,null,null,null,null,null,null,{"$f":"IF(zJmenoPrijmeni=\"\",\"\",zJmenoPrijmeni)","v":""}]
[null,null,"Přidělené ID 3P:",null,null,null,null,null,null,null,null,null,null,null,null,null,null,null,null,null,null,null,null,null,null,null,null,"IČ (popř. RČ) makléře",null,null,null,null,null,null,null,null,null,null,null,null,"Evid. č. makléře"]
[null,null,{"$f":"IF(zPrideleneId=\"\",\"\",zPrideleneId)","v":""},null,null,null,null,null,null,null,null,null,null,null,null,null,null,null,null,null,null,null,null,null,null,null,null,{"$f":"IF(zIcMaklere=\"\",\"\",zIcMaklere)","v":""},null,null,null,null,null,null,null,null,null,null,null,null,{"$f":"IF(zEvidMaklere=\"\",\"\",zevi)","v":""}]
[null,null,"Telefon makléře:",null,null,null,null,null,null,null,null,null,null,null,null,null,null,null,null,null,null,null,null,null,null,null,null,"E-mail makléře:"]
[null,null,{"$f":"IF(zTelefonMaklere=\"\",\"\",zTelefonMaklere)","v":""},null,null,null,null,null,null,null,null,null,null,null,null,null,null,null,null,null,null,null,null,null,null,null,null,{"$f":"IF(zEmailMaklere=\"\",\"\",zEmailMaklere)","v":""}]
[]
[]
[null,"SOUHLAS se zpracováním osobních údajů a použitím rodného čísla"]
[null,"V souvislosti s uzavřením/žádostí o uzavření smlouvy mezi mnou a UniCredit Bank Czech Republic and Slovakia, a.s. (dále jen „Smlouva“ a „Banka“) souhlasím s tím, aby Banka za níže uvedeným účelem shromažďovala, zpracovávala a uchovávala mé osobní údaje, tj. jméno, příjmení, datum narození, rodné číslo, adresu, údaje o identifikačním dokladu a IČ (dále jen „osobní údaje“), a to způsobem, a za podmínek uvedených v Informačním Memorandu Bankovního registru klientských informací a Nebankovního registru klientských informací (dále jen „Informační Memorandum“) a v Poučení o registrech Sdružení SOLUS (též jen „Poučení“)."]
[null,"Dále souhlasím, aby Banka mé osobní údaje předávala Sdružení SOLUS k dalšímu zpracování v „Pozitivním registru sdružení SOLUS“ (též jen „Pozitivní registr“) a v Registru FO Sdružení SOLUS (též jen „Registr FO“) k dalšímu shromažďování, zpracovávání a uchovávání. Souhlasím, aby Sdružení SOLUS vytvořilo informační soubor mých osobních údajů od všech členských bank, případně též společně s dalšími mými veřejně dostupnými osobními údaji (např. mé osobní údaje obsažené v Insolvenčním rejstříku), a v rámci tohoto informačního souboru mých osobních údajů provádělo statistická vyhodnocení mé bonity a důvěryhodnosti. Souhlasím, aby Sdružení SOLUS mé osobní údaje (ve formě informačního souboru včetně údajů o statistických vyhodnoceních mé bonity a důvěryhodnosti) zpřístupnilo formou on-line dotazů všem oprávněným uživatelům (členům sdružení SOLUS) Pozitivního registru a Registru FO, tedy i Bance, a to vždy v rozsahu a za podmínek uvedeném pro každý z těchto registrů v Poučení."]
[null,"Souhlasím, aby Banka i opakovaně získávala informace o mé bonitě, platební morálce a důvěryhodnosti z Pozitivního registru a Registru FO. Souhlasím, aby všichni oprávnění uživatelé Pozitivního registru anebo Registru FO, kterým byly zpřístupněny mé osobní údaje, tyto používali, a to případně spolu s dalšími mými osobními údaji, jež oprávněně zpracovávají."]
[null,"Účelem zpracování osobních údajů v Pozitivním registru a Registru FO je splnění povinnosti odpovědného poskytování úvěrů a jiných obchodů Banky, zajištění vzájemného informování oprávněných uživatelů Pozitivního registru a Registru FO o mé bonitě, důvěryhodnosti a platební morálce, posuzování mé bonity, důvěryhodnosti a platební morálky ze strany oprávněných uživatelů Pozitivního registru a Registru FO, a to i opakovaně, jakož i ochrana práv Banky a ostatních členů sdružení SOLUS. Kromě předešlého je účelem zpracování mých osobních údajů na základě tohoto souhlasu rovněž zajištění vzájemného informování oprávněných uživatelů Bankovního registru klientských informací (dále jen „BRKI“) a Nebankovního registru klientských informací (dále jen „NRKI“) o mé bonitě, důvěryhodnosti a platební morálce a umožnění (a to i opakovaného) posuzování mé bonity, důvěryhodnosti a platební morálky ze strany oprávněných uživatelů BRKI a NRKI. Způsob, rozsah a podmínky vzájemného informování oprávněných uživatelů BRKI a NRKI jsou uvedeny v Informačním Memorandu."]
[null,"Souhlas uděluji na dobu 4 let ode dne jeho udělení. V případě, že mezi mnou [nebo žadatelem, pokud jde o ručitele, spolužadatele nebo zákonného zástupce] a Bankou byla nebo bude uzavřena Smlouva, uděluji tento souhlas na dobu jejího trvání a na dobu dalších 4 let od splnění veškerých mých finančních závazků z uzavřené Smlouvy, pokud tyto závazky zaniknou splněním nebo způsobem nahrazujícím splnění, resp. od zániku Smlouvy, pokud finanční závazky ze Smlouvy zaniknou jinak. "]
[null,"Před podpisem tohoto souhlasu jsem se seznámil(a) s Informačním Memorandem, které obsahuje i poučení o mých právech v souvislosti se zpracováním mých osobních údajů v rámci BRKI i pro účely vzájemného informování se uživatelů BRKI a/nebo NRKI o bonitě, důvěryhodnosti či platební morálce jejich klientů. Před podpisem tohoto souhlasu jsem rovněž byl(a) informován(a), že aktuální znění Informačního Memoranda mohu kdykoli získat na informační lince, pobočkách a na webových stránkách banky www.unicreditbank.cz nebo na informační lince a webových stránkách provozovatele registru www.cbcb.cz."]
[]
[null,"Dále prohlašuji, že jsem se seznámil(a) s  dokumentem \"POUČENÍ o registrech Sdružení SOLUS\", jehož obsahem je: (i) vysvětlení pojmu informační soubor, a to zvlášť pro Pozitivní registr a Registr FO, (ii) definice dalších mých osobních údajů, které mohou vzniknout při zpracování, (iii) popis fungování Pozitivního registru a Registru FO, (iv) identifikace subjektů či osob, které mohou mít přístup k mým osobním údajům při jejich zpracování  a (v) poučení o mých právech (§ 11 a § 12 zákona o ochraně osobních údajů č. 101/2000 Sb.) a nárocích (§ 21 zákona č. 101/2000 Sb.) v souvislosti se zpracováním mých osobních údajů v rámci pozitivního registru SOLUS. Byl(a) jsem informován(a), že aktuální znění Poučení mohu kdykoli získat na informační lince, pobočkách a webových stránkách banky www.unicreditbank.cz nebo na informační lince a webových stránkách sdružení SOLUS www.solus.cz."]
[null,"Potvrzuji, že jsem byl(a) Bankou poučen(a) o svých nárocích vůči porušiteli dle § 21 zákona č. 101/2000 Sb. "]
[null,"Po uzavření Smlouvy s Bankou se tento souhlas stává její nedílnou součástí."]
[]
[null,"V",null,null,null,null,null,null,null,null,null,null,null,null,null,null,null,null,null,"dne"]
[]
[]
[]
[null,"Podpis žadatele"]
[]
[]
[]
[null,"Podpis spolužadatele"]
[]
[null,"Jméno a podpis zástupce banky, který podpis/y ověřil:"]
[]
[]
[null,null,"Vyplní Banka"]
[null,null,"Pracovník banky:",null,null,null,{"$f":"IF(zPracovnikBanky=\"\",\"\",zPracovnikBanky)","v":""},null,null,null,null,null,null,null,null,null,null,null,null,null,null,null,null,null,"Číslo klienta (NDG):",null,null,null,null,{"$f":"IF(zNdg=\"\",\"\",zNdg)","v":""}]
[null,null,"Pobočka (číslo):",null,null,null,{"$f":"IF(zPobocka=\"\",\"\",zPobocka)","v":""},null,null,null,null,null,null,null,null,null,null,null,null,null,null,null,null,null,"Číslo žádosti:",null,null,null,null,{"$f":"IF(zCisloZadosti=\"\",\"\",zCisloZadosti)","v":""}]
[]
[null,"ŽÁDOST O POSKYTNUTÍ HYPOTEČNÍHO ÚVĚRU"]
[null,null,"Vyplní klient"]
[null,null,"ÚDAJE O ŽADATELI/SPOLUŽADATELI* (DÁLE JEN \"ŽADATEL\")"]
[null,null,"Základní údaje"]
[null,null,"Jméno",null,null,null,null,null,null,null,null,null,null,null,null,null,null,null,null,"Příjmení",null,null,null,null,null,null,null,null,null,null,null,null,null,null,null,null,"Rodné číslo (bez lomítka)"]
[]
[null,null,"Datum narození",null,null,null,null,null,null,null,null,null,null,null,null,null,null,null,null,"Země narození (není-li ČR)",null,null,null,null,null,null,null,null,null,null,null,null,null,null,null,null,"Pohlaví",null,null,null,null,{"$f":"zadRC4/11=INT(zadRC4/11)","v":true}]
[null,null,{"$f":"IF(AP251=TRUE,(IF(zadRC4=\"\",\"\",DATE(IF(AND(LEN(zadRC4)=10,MID(zadRC4,1,2)*1<54),MID(zadRC4,1,2)+2000,MID(zadRC4,1,2)+1900),MID(zadRC4,3,2)-IF(MID(zadRC4,3,2)*1>12,50),MID(zadRC4,5,2)))),\"Rodné číslo je zadáno chybně!\")","v":""},null,null,null,null,null,null,null,null,null,null,null,null,null,null,null,null,null,null,null,null,null,null,null,null,null,null,null,null,null,null,null,null,null,{"$f":"IF(AP251=TRUE,(IF(zadRC4=\"\",\"\",IF(MID(zadRC4,3,2)*1<12,\"X\",\"\"))),\"\")","v":""},"Muž",null,{"$f":"IF(AP251=TRUE,(IF(zadRC4=\"\",\"\",IF(MID(zadRC4,3,2)*1>12,\"X\",\"\"))),\"\")","v":""},"Žena"]
[null,null,"Adresa trvalého pobytu (ulice, č.p., město, PSČ, země)"]
[]
[null,null,"Doklad totožnosti"]
[null,null,"Typ dokladu"]
[null,null,null,"Občanský průkaz",null,null,null,null,null,null,"Cestovní pas",null,null,null,null,null,"Identifikační karta občana EU"]
[null,null,"Číslo dokladu",null,null,null,null,null,null,null,null,null,null,null,null,null,null,null,null,"Země vydání dokladu (není-li ČR)",null,null,null,null,null,null,null,null,null,null,null,null,null,null,null,null,"Datum vydání dokladu"]
[]
[null,null,"Kontaktní údaje"]
[null,null,"Telefon",null,null,null,null,null,null,null,null,null,null,null,null,null,null,null,null,"E-mail"]
[]
[]
[null,null,"ÚDAJE O POŽADOVANÉM  ÚVĚRU"]
[null,null,"Účel úvěru refinancování",null,null,null,null,null,null,null,null,null,null,null,null,null,null,null,null,"Celková výše úvěru v Kč**",null,null,null,null,null,null,null,null,null,null,null,null,null,null,null,null,"Počet splátek"]
[null,null,{"$f":"IF(HlavUcelUveru=\"Refinancování úvěru - zjednodušené\",\"X\",IF(HlavUcelUveru=\"Refinancování úvěru - standard\",\"X\",\"\"))","v":""},"Ano",null,null,{"$f":"IF(zadUcelUveru41=\"X\",\"\",\"X\")","v":"X"},"Ne",null,null,null,null,null,null,null,null,null,null,null,{"$f":"IF(SlevaCardif=\"Ano\",(IF(VyseUveru=0,\"\",VyseUveru)),(IF(VyseUveruZaklad+vyseUveru2=0,\"\",VyseUveruZaklad+vyseUveru2)))","v":2060000},null,null,null,null,null,null,null,null,null,null,null,null,null,null,null,null,{"$f":"DobaSplatnosti*12","v":300}]
[null,null,"Úvěr v kombinaci s neúčelovou částí***",null,null,null,null,null,null,null,null,null,null,null,null,null,null,null,null,"Výše účelové části v Kč",null,null,null,null,null,null,null,null,null,null,null,null,null,null,null,null,"Výše neúčelové části v Kč"]
[null,null,{"$f":"IF(TypHypoteky=\"Hypoteční úvěr účelový rezidenční Twin\",\"X\",\"\")","v":""},"Ano",null,null,{"$f":"IF(TypHypoteky<>\"Hypoteční úvěr účelový rezidenční Twin\",\"X\",\"\")","v":"X"},"Ne",null,null,null,null,null,null,null,null,null,null,null,{"$f":"IF(zadUverVKomb42=\"x\",\"\",VyseUveruZaklad)","v":""},null,null,null,null,null,null,null,null,null,null,null,null,null,null,null,null,{"$f":"IF(zadUverVKomb42=\"x\",\"\",vyseUveru2)","v":""}]
[]
[null,null,"PROHLÁŠENÍ ŽADATELE "]
[null,null,"Žadatel prohlašuje, že veškeré údaje uvedené v této žádosti o poskytnutí úvěru, resp. v dokumentech přiložených, jsou úplné a odpovídají skutečnosti a že nezamlčel žádnou relevantní skutečnost, která by mohla ovlivnit rozhodnutí UniCredit Bank Czech Republic and Slovakia, a.s. (dále jen „Banka“) při poskytnutí úvěru. \n\n\n\n"]
[null,null,"Dále Žadatel prohlašuje, že je plně svéprávný a že ke dni podání této žádosti o poskytnutí úvěru není v prodlení vůči státu nebo jinému subjektu s úhradou daní či poplatků, úhradou pojistného na sociální zabezpečení, zdravotní pojištění, úhradou cla nebo jiných povinných plateb."]
[null,null,"Žadatel souhlasí s tím, aby Banka získala informace o jeho bonitě (zahrnující zejména informaci o povaze a rozsahu případného porušení dřívějších závazků), platební morálce a důvěryhodnosti, které jsou nutné k posouzení žádosti o poskytnutí úvěru, a to z registrů sdružení SOLUS (www.solus.cz), jehož je Banka členem.\n"]
[null,null,"Žadatel potvrzuje, že se seznámil s \"Poučením o zpracování osobních údajů podle § 11 zákona č. 101/2000 Sb., o ochraně osobních údajů\", které je k dispozici mj. na webových stránkách a pobočkách Banky, zejména výslovně bere na vědomí, že Banka může jeho osobní údaje zpracovávat i prostřednictvím zpracovatelů se sídlem v členských státech Evropské unie, zejm. UniCredit Business Integrated Solutions S.C.p.A., Itálie. Veškerá místa, na kterých dochází ke zpracování osobních údajů Bankou nebo zpracovateli Banky, jsou nahlášena jako místa zpracování osobních údajů u Úřadu pro ochranu osobních údajů."]
[]
[]
[]
[null,null,"Místo, datum",null,null,null,null,null,null,null,null,null,null,null,null,null,null,null,null,null,null,null,null,null,null,null,null,"Podpis Žadatele"]
[null,null,"* Nehodící se škrtněte"]
[null,null,"** Včetně všech nákladů, které budou z úvěru hrazeny (životní pojištění, poplatky atd.)"]
[null,null,"*** Hypoteční úvěr Twin (rezidenční hypoteční úvěr kombinovaný s neúčelovou částí)"]
[null,null,"Vyplní Banka / Pověřený zástupce Banky / Třetí strana - rozdělit"]
[null,null,"Totožnost ověřil (jméno, příjmení):",null,null,null,null,null,null,null,null,null,null,null,null,null,null,null,null,null,null,null,null,null,null,null,null,"Dne:",null,null,null,null,null,null,null,null,null,null,null,null,"Podpis:"]
[null,null,{"$f":"IF(zTotoznostOveril=\"\",\"\",zTotoznostOveril)","v":""},null,null,null,null,null,null,null,null,null,null,null,null,null,null,null,null,null,null,null,null,null,null,null,null,{"$f":"IF(zDne=\"\",\"\",zDne)","v":""}]
[null,null,"Název (jméno) 3P:",null,null,null,null,null,null,null,null,null,null,null,null,null,null,null,null,null,null,null,null,null,null,null,null,"Jméno a příjmení makléře:"]
[null,null,{"$f":"IF(zNazev3p=\"\",\"\",zNazev3p)","v":""},null,null,null,null,null,null,null,null,null,null,null,null,null,null,null,null,null,null,null,null,null,null,null,null,{"$f":"IF(zJmenoPrijmeni=\"\",\"\",zJmenoPrijmeni)","v":""}]
[null,null,"Přidělené ID 3P:",null,null,null,null,null,null,null,null,null,null,null,null,null,null,null,null,null,null,null,null,null,null,null,null,"IČ (popř. RČ) makléře",null,null,null,null,null,null,null,null,null,null,null,null,"Evid. č. makléře"]
[null,null,{"$f":"IF(zPrideleneId=\"\",\"\",zPrideleneId)","v":""},null,null,null,null,null,null,null,null,null,null,null,null,null,null,null,null,null,null,null,null,null,null,null,null,{"$f":"IF(zIcMaklere=\"\",\"\",zIcMaklere)","v":""},null,null,null,null,null,null,null,null,null,null,null,null,{"$f":"IF(zEvidMaklere=\"\",\"\",zEvidMaklere)","v":""}]
[null,null,"Telefon makléře:",null,null,null,null,null,null,null,null,null,null,null,null,null,null,null,null,null,null,null,null,null,null,null,null,"E-mail makléře:"]
[null,null,{"$f":"IF(zTelefonMaklere=\"\",\"\",zTelefonMaklere)","v":""},null,null,null,null,null,null,null,null,null,null,null,null,null,null,null,null,null,null,null,null,null,null,null,null,{"$f":"IF(zEmailMaklere=\"\",\"\",zEmailMaklere)","v":""}]
[]
[]
[null,"SOUHLAS se zpracováním osobních údajů a použitím rodného čísla"]
[null,"V souvislosti s uzavřením/žádostí o uzavření smlouvy mezi mnou a UniCredit Bank Czech Republic and Slovakia, a.s. (dále jen „Smlouva“ a „Banka“) souhlasím s tím, aby Banka za níže uvedeným účelem shromažďovala, zpracovávala a uchovávala mé osobní údaje, tj. jméno, příjmení, datum narození, rodné číslo, adresu, údaje o identifikačním dokladu a IČ (dále jen „osobní údaje“), a to způsobem, a za podmínek uvedených v Informačním Memorandu Bankovního registru klientských informací a Nebankovního registru klientských informací (dále jen „Informační Memorandum“) a v Poučení o registrech Sdružení SOLUS (též jen „Poučení“)."]
[null,"Dále souhlasím, aby Banka mé osobní údaje předávala Sdružení SOLUS k dalšímu zpracování v „Pozitivním registru sdružení SOLUS“ (též jen „Pozitivní registr“) a v Registru FO Sdružení SOLUS (též jen „Registr FO“) k dalšímu shromažďování, zpracovávání a uchovávání. Souhlasím, aby Sdružení SOLUS vytvořilo informační soubor mých osobních údajů od všech členských bank, případně též společně s dalšími mými veřejně dostupnými osobními údaji (např. mé osobní údaje obsažené v Insolvenčním rejstříku), a v rámci tohoto informačního souboru mých osobních údajů provádělo statistická vyhodnocení mé bonity a důvěryhodnosti. Souhlasím, aby Sdružení SOLUS mé osobní údaje (ve formě informačního souboru včetně údajů o statistických vyhodnoceních mé bonity a důvěryhodnosti) zpřístupnilo formou on-line dotazů všem oprávněným uživatelům (členům sdružení SOLUS) Pozitivního registru a Registru FO, tedy i Bance, a to vždy v rozsahu a za podmínek uvedeném pro každý z těchto registrů v Poučení."]
[null,"Souhlasím, aby Banka i opakovaně získávala informace o mé bonitě, platební morálce a důvěryhodnosti z Pozitivního registru a Registru FO. Souhlasím, aby všichni oprávnění uživatelé Pozitivního registru anebo Registru FO, kterým byly zpřístupněny mé osobní údaje, tyto používali, a to případně spolu s dalšími mými osobními údaji, jež oprávněně zpracovávají."]
[null,"Účelem zpracování osobních údajů v Pozitivním registru a Registru FO je splnění povinnosti odpovědného poskytování úvěrů a jiných obchodů Banky, zajištění vzájemného informování oprávněných uživatelů Pozitivního registru a Registru FO o mé bonitě, důvěryhodnosti a platební morálce, posuzování mé bonity, důvěryhodnosti a platební morálky ze strany oprávněných uživatelů Pozitivního registru a Registru FO, a to i opakovaně, jakož i ochrana práv Banky a ostatních členů sdružení SOLUS. Kromě předešlého je účelem zpracování mých osobních údajů na základě tohoto souhlasu rovněž zajištění vzájemného informování oprávněných uživatelů Bankovního registru klientských informací (dále jen „BRKI“) a Nebankovního registru klientských informací (dále jen „NRKI“) o mé bonitě, důvěryhodnosti a platební morálce a umožnění (a to i opakovaného) posuzování mé bonity, důvěryhodnosti a platební morálky ze strany oprávněných uživatelů BRKI a NRKI. Způsob, rozsah a podmínky vzájemného informování oprávněných uživatelů BRKI a NRKI jsou uvedeny v Informačním Memorandu."]
[null,"Souhlas uděluji na dobu 4 let ode dne jeho udělení. V případě, že mezi mnou [nebo žadatelem, pokud jde o ručitele, spolužadatele nebo zákonného zástupce] a Bankou byla nebo bude uzavřena Smlouva, uděluji tento souhlas na dobu jejího trvání a na dobu dalších 4 let od splnění veškerých mých finančních závazků z uzavřené Smlouvy, pokud tyto závazky zaniknou splněním nebo způsobem nahrazujícím splnění, resp. od zániku Smlouvy, pokud finanční závazky ze Smlouvy zaniknou jinak. "]
[null,"Před podpisem tohoto souhlasu jsem se seznámil(a) s Informačním Memorandem, které obsahuje i poučení o mých právech v souvislosti se zpracováním mých osobních údajů v rámci BRKI i pro účely vzájemného informování se uživatelů BRKI a/nebo NRKI o bonitě, důvěryhodnosti či platební morálce jejich klientů. Před podpisem tohoto souhlasu jsem rovněž byl(a) informován(a), že aktuální znění Informačního Memoranda mohu kdykoli získat na informační lince, pobočkách a na webových stránkách banky www.unicreditbank.cz nebo na informační lince a webových stránkách provozovatele registru www.cbcb.cz."]
[]
[null,"Dále prohlašuji, že jsem se seznámil(a) s  dokumentem \"POUČENÍ o registrech Sdružení SOLUS\", jehož obsahem je: (i) vysvětlení pojmu informační soubor, a to zvlášť pro Pozitivní registr a Registr FO, (ii) definice dalších mých osobních údajů, které mohou vzniknout při zpracování, (iii) popis fungování Pozitivního registru a Registru FO, (iv) identifikace subjektů či osob, které mohou mít přístup k mým osobním údajům při jejich zpracování  a (v) poučení o mých právech (§ 11 a § 12 zákona o ochraně osobních údajů č. 101/2000 Sb.) a nárocích (§ 21 zákona č. 101/2000 Sb.) v souvislosti se zpracováním mých osobních údajů v rámci pozitivního registru SOLUS. Byl(a) jsem informován(a), že aktuální znění Poučení mohu kdykoli získat na informační lince, pobočkách a webových stránkách banky www.unicreditbank.cz nebo na informační lince a webových stránkách sdružení SOLUS www.solus.cz."]
[null,"Potvrzuji, že jsem byl(a) Bankou poučen(a) o svých nárocích vůči porušiteli dle § 21 zákona č. 101/2000 Sb. "]
[null,"Po uzavření Smlouvy s Bankou se tento souhlas stává její nedílnou součástí."]
[]
[null,"V",null,null,null,null,null,null,null,null,null,null,null,null,null,null,null,null,null,"dne"]
[]
[]
[]
[null,"Podpis žadatele"]
[]
[]
[]
[null,"Podpis spolužadatele"]
[]
[null,"Jméno a podpis zástupce banky, který podpis/y ověřil:"]

{"sheet":"Dokumenty","index":10,"n_rows":166,"n_cols":18,"rows_kept":166,"cut":false,"hidden":false,"merged":[[38,2,38,6],[39,2,39,6],[38,9,38,10],[38,7,38,8],[39,7,39,8],[40,7,40,8],[60,2,60,6],[48,9,48,10],[39,9,39,10],[40,9,40,10],[41,9,41,10],[42,9,42,10],[43,9,43,10],[49,9,49,10],[50,9,50,10],[51,9,51,10],[41,7,41,8],[42,7,42,8],[43,7,43,8],[44,7,44,8],[45,7,45,8],[46,7,46,8],[49,2,49,6],[50,2,50,6],[71,9,71,10],[52,9,52,10],[55,9,55,10],[44,9,44,10],[45,9,45,10],[46,9,46,10],[47,9,47,10],[61,9,61,10],[62,9,62,10],[66,9,66,10],[67,9,67,10],[68,9,68,10],[69,9,69,10],[70,9,70,10],[63,9,63,10],[64,9,64,10],[65,9,65,10],[56,9,56,10],[57,9,57,10],[58,9,58,10],[59,9,59,10],[60,9,60,10],[52,2,52,6],[53,2,53,6],[51,2,51,6],[40,2,40,6],[41,2,41,6],[42,2,42,6],[43,2,43,6],[44,2,44,6],[45,2,45,6],[46,2,46,6],[47,2,47,6],[48,2,48,6],[76,9,76,10],[77,9,77,10],[78,9,78,10],[79,9,79,10],[80,9,80,10],[72,9,72,10],[73,9,73,10],[74,9,74,10],[75,9,75,10],[86,9,86,10],[87,9,87,10],[88,9,88,10],[89,9,89,10],[90,9,90,10],[81,9,81,10],[82,9,82,10],[83,9,83,10],[84,9,84,10],[85,9,85,10],[96,9,96,10],[97,9,97,10],[98,9,98,10],[99,9,99,10],[100,9,100,10],[91,9,91,10],[92,9,92,10],[93,9,93,10],[94,9,94,10],[95,9,95,10],[106,9,106,10],[107,9,107,10],[108,9,108,10],[109,9,109,10],[115,9,115,10],[116,9,116,10],[110,9,110,10],[101,9,101,10],[102,9,102,10],[103,9,103,10],[104,9,104,10],[149,9,149,10],[150,9,150,10],[151,9,151,10],[152,9,152,10],[143,9,143,10],[144,9,144,10],[145,9,145,10],[146,9,146,10],[147,9,147,10],[165,9,165,10],[158,9,158,10],[159,9,159,10],[160,9,160,10],[161,9,161,10],[153,9,153,10],[154,9,154,10],[155,9,155,10],[156,9,156,10],[157,9,157,10],[162,9,162,10],[163,9,163,10],[164,9,164,10],[47,7,47,8],[48,7,48,8],[49,7,49,8],[50,7,50,8],[51,7,51,8],[52,7,52,8],[128,9,128,10],[129,9,129,10],[130,9,130,10],[55,7,55,8],[56,7,56,8],[57,7,57,8],[58,7,58,8],[59,7,59,8],[123,9,123,10],[124,9,124,10],[125,9,125,10],[126,9,126,10],[127,9,127,10],[114,9,114,10],[119,9,119,10],[120,9,120,10],[121,9,121,10],[122,9,122,10],[60,7,60,8],[61,7,61,8],[62,7,62,8],[63,7,63,8],[64,7,64,8],[135,9,135,10],[136,9,136,10],[137,9,137,10],[148,9,148,10],[139,9,139,10],[138,9,138,10],[131,9,131,10],[132,9,132,10],[140,9,140,10],[141,9,141,10],[142,9,142,10],[133,9,133,10],[134,9,134,10],[111,9,111,10],[112,9,112,10],[113,9,113,10],[117,9,117,10],[118,9,118,10],[105,9,105,10],[70,7,70,8],[71,7,71,8],[72,7,72,8],[73,7,73,8],[74,7,74,8],[65,7,65,8],[66,7,66,8],[67,7,67,8],[68,7,68,8],[69,7,69,8],[80,7,80,8],[81,7,81,8],[82,7,82,8],[83,7,83,8],[84,7,84,8],[75,7,75,8],[76,7,76,8],[77,7,77,8],[78,7,78,8],[79,7,79,8],[90,7,90,8],[91,7,91,8],[92,7,92,8],[93,7,93,8],[94,7,94,8],[85,7,85,8],[86,7,86,8],[87,7,87,8],[88,7,88,8],[89,7,89,8],[100,7,100,8],[101,7,101,8],[102,7,102,8],[103,7,103,8],[95,7,95,8],[96,7,96,8],[97,7,97,8],[98,7,98,8],[99,7,99,8],[109,7,109,8],[110,7,110,8],[111,7,111,8],[112,7,112,8],[117,7,117,8],[122,7,122,8],[123,7,123,8],[124,7,124,8],[104,7,104,8],[105,7,105,8],[106,7,106,8],[107,7,107,8],[108,7,108,8],[125,7,125,8],[126,7,126,8],[113,7,113,8],[114,7,114,8],[119,7,119,8],[120,7,120,8],[121,7,121,8],[132,7,132,8],[133,7,133,8],[115,7,115,8],[116,7,116,8],[118,7,118,8],[134,7,134,8],[135,7,135,8],[136,7,136,8],[127,7,127,8],[128,7,128,8],[129,7,129,8],[130,7,130,8],[131,7,131,8],[142,7,142,8],[163,7,163,8],[164,7,164,8],[165,7,165,8],[157,7,157,8],[158,7,158,8],[159,7,159,8],[160,7,160,8],[161,7,161,8],[162,7,162,8],[55,2,55,6],[56,2,56,6],[57,2,57,6],[58,2,58,6],[59,2,59,6],[156,7,156,8],[147,7,147,8],[148,7,148,8],[149,7,149,8],[150,7,150,8],[151,7,151,8],[152,7,152,8],[153,7,153,8],[154,7,154,8],[155,7,155,8],[143,7,143,8],[144,7,144,8],[145,7,145,8],[146,7,146,8],[137,7,137,8],[138,7,138,8],[139,7,139,8],[140,7,140,8],[141,7,141,8],[65,2,65,6],[66,2,66,6],[67,2,67,6],[68,2,68,6],[69,2,69,6],[61,2,61,6],[62,2,62,6],[63,2,63,6],[64,2,64,6],[84,2,84,6],[75,2,75,6],[76,2,76,6],[77,2,77,6],[78,2,78,6],[79,2,79,6],[70,2,70,6],[71,2,71,6],[72,2,72,6],[73,2,73,6],[74,2,74,6],[132,2,132,6],[117,2,117,6],[118,2,118,6],[95,2,95,6],[96,2,96,6],[97,2,97,6],[98,2,98,6],[99,2,99,6],[122,2,122,6],[123,2,123,6],[127,2,127,6],[128,2,128,6],[129,2,129,6],[130,2,130,6],[131,2,131,6],[124,2,124,6],[125,2,125,6],[126,2,126,6],[113,2,113,6],[114,2,114,6],[119,2,119,6],[120,2,120,6],[121,2,121,6],[137,2,137,6],[138,2,138,6],[139,2,139,6],[140,2,140,6],[141,2,141,6],[133,2,133,6],[134,2,134,6],[135,2,135,6],[136,2,136,6],[150,2,150,6],[151,2,151,6],[162,2,162,6],[163,2,163,6],[164,2,164,6],[142,2,142,6],[143,2,143,6],[144,2,144,6],[145,2,145,6],[146,2,146,6],[165,2,165,6],[157,2,157,6],[158,2,158,6],[159,2,159,6],[160,2,160,6],[108,2,108,6],[100,2,100,6],[101,2,101,6],[102,2,102,6],[103,2,103,6],[161,2,161,6],[152,2,152,6],[153,2,153,6],[154,2,154,6],[155,2,155,6],[116,2,116,6],[109,2,109,6],[110,2,110,6],[111,2,111,6],[112,2,112,6],[156,2,156,6],[147,2,147,6],[148,2,148,6],[149,2,149,6],[53,7,53,8],[53,9,53,10],[54,2,54,6],[54,7,54,8],[54,9,54,10],[115,2,115,6],[104,2,104,6],[105,2,105,6],[106,2,106,6],[107,2,107,6],[90,2,90,6],[91,2,91,6],[92,2,92,6],[93,2,93,6],[94,2,94,6],[85,2,85,6],[86,2,86,6],[87,2,87,6],[88,2,88,6],[89,2,89,6],[80,2,80,6],[81,2,81,6],[82,2,82,6],[83,2,83,6]]}
[]
[]
[null,"       POŽADOVANÉ DOKUMENTY",null,null,null,null,null,null,null,null,null,{"$f":"manVerze","v":"v.14a"}]
[]
[null,null,null,null,null,null,null,null,null,null,null,null,null,null,null,"občan ČR","standardní","ano"]
[null,null,null,null,null,null,null,null,null,null,null,null,null,null,null,"občan SR","nestandardní","ne"]
[]
[]
[null,0]
[]
[]
[null,null,"Příjem klienta je:"]
[]
[]
[]
[]
[]
[null,null,"Účel úvěru je:"]
[]
[]
[]
[]
[]
[]
[]
[]
[]
[]
[]
[]
[null,null,"*) starobní, vdovský (akceptováno max. 60%), sirotčí důchod, rodičovský příspěvek, renta (bývalí vojáci z povolání, policisté, horníci apod.), příspěvek na bydlení vojáků z povolání"]
[]
[]
[]
[]
[]
[]
[]
[null,null,"Požadovaný dokument",null,null,null,null,"Předložit nejpozději",null,"Skupina dokumentů"]
[null,null,"Žádost o úvěr",null,null,null,null,"Žádost",null,"interní dokumenty"]
[null,null,"Doplňující informace k žádosti",null,null,null,null,"Žádost",null,"interní dokumenty"]
[null,null,"Kompletně vyplněná Hypokalkulačka 3P uložená v DMS – formát .xls",null,null,null,null,"Žádost",null,"interní dokumenty"]
[null,null,"Výstupy z Expert-toolu",null,null,null,null,"Žádost",null,"interní dokumenty"]
[null,null,"Výstup z kalkulačky max. LTV  (pouze v případě interního odhadu/verifikace externího ocenění interním odhadcem a zároveň je-li mezi zástavní hodnotou nemovitosti uvedenou ve verifikaci odhadu a tržní hodnotou nemovitosti rozdíl více než 25%)",null,null,null,null,"Žádost",null,"interní dokumenty"]
[null,null,"Výpis z KN předmětu zástavy (ne starší 3 měsíce)\n- v případě bytové jednotky musí být předložen výpis z KN k bytu, event. pozemku (je-li vlastník odlišný od vlastníka byt.jednotky)",null,null,null,null,"Žádost",null,"zajištění"]
[null,null,"Kopie příslušné části katastrální mapy, která je v souladu s aktuálním výpisem z KN, (pokud je mapa digitalizována, postačí výtisk mapy z neplaceného dálkového náhledu cuzk)",null,null,null,null,"Žádost",null,"zajištění"]
[null,null,"Odhad nemovitosti vypracovaný smluvním odhadcem dle metodiky banky ne starší 1 rok\n",null,null,null,null,"Žádost",null,"zajištění"]
[null,null,"Doklady prokazující rodinný stav zástavce  (požadujeme pouze je-li zastavovanou nemovitostí byt nebo dům/ nepožadujeme, pokud je zastavovaný byt nebo dům v SJM nebo v podílovém spoluvlastnictví)",null,null,null,null,"Žádost",null,"zajištění"]
[null,null,"Výpisy z úvěrových registrů zástavce (pouze bude-li trvale odlišný od spolu/žadatele a nejedná se o osobu blízkou, tj. nikoli prodávající). Osoba blízká výpisy dokládá jde-li o neúčelový HU.",null,null,null,null,"Žádost",null,"zajištění"]
[null,null,"Listina prokazující oprávnění nakládat s nemovitým předmětem zástavy, (pouze pokud dosud trvající vlastnické právo k nemovitosti vzniklo před 1.1.1993 - úředně ověřený opis)",null,null,null,null,"Žádost",null,"zajištění"]
[null,null,"Souhlas zástavního věřitele - stavební spořitelny nebo SFRB - se zřízením zástavního práva ve 2. pořadí zápisu (pokud v rámci poskytnutého úvěru nedojde ke splacení závazků na 1. místě)",null,null,null,null,"Žádost",null,"zajištění"]
[null,null,"Průvodní list úvěrového případu - předávací protokol o předání podkladků k úvěru externím subjektem",null,null,null,null,"Žádost",null,"interní dokumenty"]
[null,null,"Schválení žádosti o výjimku, která má být uplatněna (e-mailová komunikace)",null,null,null,null,"Žádost",null,"interní dokumenty"]
[null,null,"Vyplněný zdravotní dotazník",null,null,null,null,"Žádost",null,"klient"]
[null,null,"Smlouva o sjednaném životním pojištění (pojistná částka musí být rovna minimálně požadované výši úvěru)",null,null,null,null,"Žádost",null,"klient"]
[null,null,"Občanský průkaz (lhůta platnosti OP v době identifikace ještě min. 1 měsíc)",null,null,null,null,"Žádost",null,"klient"]
[null,null,"Povolení k trvalému pobytu\n+ Doklad na základě kterého bylo povolení vydáno (Platný cestovní pas/Platná identifikační karta občana EU)\n+ Doklad o přidělení českého rodného čísla / Řidičský průkaz ČR s uvedeným RČ (pokud není RČ uvedeno na některém z podkladů, který klient dokladá - např. ID karta, potvrzení o trv.pobytu).",null,null,null,null,"Žádost",null,"klient"]
[null,null,"Dohoda/pravomocné rozhodnutí soudu modifikující SJM",null,null,null,null,"Žádost",null,"klient"]
[null,null,"Po rozvodu manželství (před méně než 3 lety): \n- Pravomocné rozhodnutí soudu o zániku manželství rozvodem\n- Doklad o vypořádání SJM\n- Doklad o určení výše výživného (jsou-li nezaopatřené děti)",null,null,null,null,"Žádost",null,"klient"]
[null,null,"Po rozvodu manželství (před více než 3 lety a manželé nemají vypořádáno SJM): \n- Pravomocné rozhodnutí soudu o zániku manželství rozvodem (pouze pokud není z dokladu totožnosti zřejmé, že je klient rozvedený více než 3 roky). \n- Doklad o určení výše výživného (jsou-li nezaopatřené děti)",null,null,null,null,"Žádost",null,"klient"]
[null,null,"Plná moc pro zastupování klienta třetí osobou",null,null,null,null,"Žádost",null,"klient"]
[null,null,"Prokázání osoby blízké",null,null,null,null,"Schválení",null,"klient"]
[null,null,"Povolení k pobytu\n+ Doklad na základě kterého bylo povolení vydáno (Platný cestovní pas/Platná identifikační karta občana EU)",null,null,null,null,"Žádost",null,"klient"]
[null,null,"Jen pro občany Slovenské republiky (nesplňující definici standardního klienta):\nObčanský průkaz SR obsahující rodné číslo \n+  platný cestovní pas nebo povolení k pobytu v ČR",null,null,null,null,"Žádost",null,"klient"]
[null,null,"Pokud adresa na výpisech z bankovního účtu (viz. list Doklady - příjmy) a adresa uvedená klientem v žádosti o úvěr jsou rozdílné, klient doloží některý z následujících dokladů pro ověření skutečného pobytu klienta v ČR (doklad ne starší 3 měsíců):\n - rozpis SIPO;\n - faktura / doklad o platbě spotřeby energií, vodného / stočného, komunálního odpadu;\n - platby telefonu – pevné linky, kabelové televize apod.",null,null,null,null,"Žádost",null,"klient"]
[null,null,"Výpis z úvěrového registru SR:   SBCB (www.sbcb.sk)     \n - občan SR v případě, kdy nedokládá povolení k trvalému pobytu",null,null,null,null,"Schválení",null,"klient"]
[null,null,"Výpisy z úvěrových registrů ze země trvalého pobytu",null,null,null,null,"Žádost",null,"klient"]
[null,null,"Potvrzení o příjmu (formulář UCBCZ&SK)",null,null,null,null,"Žádost",null,"příjmy - ze závislé činnosti"]
[null,null,"Kompletní výpis z účtu za poslední měsíc u kterékoli banky v ČR",null,null,null,null,"Žádost",null,"příjmy - ze závislé činnosti"]
[null,null,"Občan SR v případě, kdy nedokládá povolení k pobytu:\nVýpisy z účtu u kterékoli banky v ČR prokazující pravidelné příjmy a obvyklé výdaje domácnosti za posledních 6 měsíců",null,null,null,null,"Žádost",null,"příjmy - ze závislé činnosti/ z podnikání/ jiný standardní příjem"]
[null,null,"Má-li spolu/žadatel příjem z vlastní společnosti/společnosti s majetkovou účastí osoby blízké > 33%, dokládá se přiznání k dani z příjmů právnických osob, vč. příloh, za poslední zdaňovací období (Podepsaná kopie DP s originál razítkem příslušného FÚ, elektronicky podané DP*, s podacím lístkem). Zároveň doklad o zaplacení daně NEBO doklad o vrácení přeplatku za poslední zdaňovací období.\nPro tuto společnost musí být zpracován rating v SB Kalkulátoru / ACE při obratu do 50 mil. - nad 50mil. obratu je potřeba kontaktovat příslušného SME poradce.",null,null,null,null,"Žádost",null,"příjmy - ze závislé činnosti"]
[null,null,"Výpisy z účtu u kterékoli banky v ČR nebo banky země pobytu klienta prokazující příjmy za poslední 3 měsíce (u klientů UCB opis obratů na účtu)    +   pracovní smlouva spolu se mzdovým výměrem",null,null,null,null,"Žádost",null,"příjmy - ze závislé činnosti v zahraničí"]
[null,null,"Výpisy z účtu u kterékoli banky v ČR prokazující pravidelné příjmy a obvyklé výdaje domácnosti za poslední 6 měsíců       \n+   pracovní smlouva spolu se mzdovým výměrem  (pouze pokud má klient příjem ze závislé činnosti)",null,null,null,null,"Žádost",null,"příjmy"]
[null,null,"Je-li klient zastupován daňovým poradcem, pak plná moc daňového poradce podaná na FÚ (např. s podacím razítkem podatelny; je vyžadováno od 1.4. do 30.6., nepředložil-li klient DP za uplynulý rok)",null,null,null,null,"Žádost",null,"příjmy"]
[null,null,"Čestné prohlášení o nulovém příjmu z podnikání, případně DP s nulovým základem.",null,null,null,null,"Žádost",null,"příjmy - aktivní živnost nevyužívaná"]
[null,null,"DP za poslední zdaňovací období (Podepsaná kopie DP s originál razítkem příslušného FÚ, elektronicky podané DP*,  s podacím lístkem). Zároveň doklad o zaplacení daně NEBO doklad o vrácení přeplatku za poslední zdaňovací období.",null,null,null,null,"Žádost",null,"příjmy - přerušení živnosti"]
[null,null,"Přiznání k dani z příjmů fyzických osob za poslední kompletní zdaňovací období včetně příloh - klientem (Podepsaná kopie DP s originál razítkem příslušného FÚ, elektronicky podané DP*, s podacím lístkem). Zároveň doklad o zaplacení daně NEBO doklad o vrácení přeplatku za poslední zdaňovací období.",null,null,null,null,"Žádost",null,"příjmy - z podnikání"]
[null,null,"Přiznání k dani z příjmů fyzických osob za poslední 2 kompletní zdaňovací období včetně příloh - klientem (Podepsaná kopie DP s originál razítkem příslušného FÚ, elektronicky podané DP*, s podacím lístkem). Zároveň doklad o zaplacení daně NEBO doklad o vrácení přeplatku za poslední zdaňovací období.",null,null,null,null,"Žádost",null,"příjmy - z podnikání"]
[null,null,"Výpisy z účtu u kterékoli banky v ČR prokazující pravidelné příjmy a obvyklé výdaje domácnosti za poslední 6 měsíců",null,null,null,null,"Žádost",null,"příjmy - z podnikání"]
[null,null,"Přiznání k dani z příjmů fyzických osob za poslední kompletní zdaňovací období včetně příloh prokazující příjmy z pronájmu. Zároveň doklad o zaplacení daně NEBO doklad o vrácení přeplatku za poslední zdaňovací období. Jsou-li příjmy z pronájmu akceptovány do příjmů spolu/žadatele, musí být zajištěna jejich bezhotovostní úhrada na BÚ v UCB",null,null,null,null,"Žádost",null,"příjmy - z pronájmu"]
[null,null,"Nájemní smlouvu k pronajímané nemovitosti",null,null,null,null,"Žádost",null,"příjmy - z pronájmu"]
[null,null,"Výpis z KN pronajímané nemovitosti\n- v případě bytové jednotky musí být předložen výpis z KN k bytu, domu, ve kterém se byt nachází, event. pozemku (je-li vlastník odlišný od vlastníka byt.jednotky)",null,null,null,null,"Žádost",null,"příjmy - z pronájmu"]
[null,null,"Odpisový plán (pokud jsou odpisy nemovitosti uvedeny v nákladech v daňovém přiznání)",null,null,null,null,"Žádost",null,"příjmy - z pronájmu"]
[null,null,"Návrh nájemní smlouvy, je-li uplatňován příjem z budoucího nájmu",null,null,null,null,"Žádost",null,"příjmy - z pronájmu"]
[null,null,"Stanovisko odd. Oceňování nemovitostí k reálnosti budoucích příjmů z pronájmu (vyžádá si bankéř), je-li uplatňován příjem z budoucího nájmu",null,null,null,null,"Žádost",null,"interní dokumenty"]
[null,null,"Potvrzení správy sociálního zabezpečení, resp. subjektu zajišťujícího výplatu konkrétního standardního příjmu (rozhodnutí Ministerstva obrany, rozhodnutí Ministerstva vnitra, položka na Potvrzení o příjmu apod.)",null,null,null,null,"Žádost",null,"příjmy - jiný standardní příjem"]
[null,null,"Výživné: Soudní rozhodnutí a doklady o příjmu výživného za poslední 3 měsíce tzn. výpis z BÚ klienta/složenka, akceptováno max. 4.000 CZK/dítě",null,null,null,null,"Žádost",null,"příjmy - výživné"]
[null,null,"Odměna pěstouna:\n- Rozhodnutí o svěření dítěte do pěstounské péče nebo rozhodnutí soudu, kterým byl klient ustanoven jako poručník dítěte\n- Rozhodnutí o přiznání dávky (odměny pěstouna)\n- PoP vyplněné příslušným Úřadem práce, který odměnu vyplácí",null,null,null,null,"Žádost",null,"příjmy - odměna pěstouna"]
[null,null,"Výpisy z účtu u kterékoli banky v ČR prokazující pravidelné příjmy a obvyklé výdaje domácnosti za posledních 6 měsíců (nestandardní klient)",null,null,null,null,"Žádost",null,"příjmy - jiný standardní příjem"]
[null,null,"Přiznání k dani z příjmů právnických osob za poslední 2 zdaňovací období společnosti vyplácející podíly na zisku společnosti (vč. všech příloh). Zároveň doklad o zaplacení daně NEBO doklad o vrácení přeplatku za poslední zdaňovací období.",null,null,null,null,"Žádost",null,"příjmy - z podílu"]
[null,null,"Rozhodnutí valné hromady společnosti o rozdělení zisku",null,null,null,null,"Žádost",null,"příjmy - z podílu"]
[null,null,"Doklad o výplatě podílů na zisku ve prospěch účtu spolu/žadatele o úvěr",null,null,null,null,"Žádost",null,"příjmy - z podílu"]
[null,null,"Konkretizovaný návrh Rezervační smlouvy + konkretizovaný návrh SoSBK / Kupní smlouvy, který musí obsahovat identifikaci prodávajícího a kupujícího, předmětu koupě a  způsob vypořádání kupní ceny, event. podepsaná Kupní smlouva nebo podepsaná Smlouva o smlouvě budoucí kupní (má-li klient již uzavřenu)",null,null,null,null,"Žádost",null,"účel - koupě"]
[null,null,"Koupě z developerského projektu: vázne-li na nemovitosti zástavní právo zajišťující úvěr developera, předložit prohlášení zástavního věřitele o podmínkách vzdání se zástavního práva k nemovitosti, event. prohlášení o právním zajištění přístupu k předmětné nemovitosti. Pro developerské projekty financované UCBCZ&SK zajistí bankéř (nikoli klient).",null,null,null,null,"Žádost",null,"účel - koupě"]
[null,null,"Koupě pozemku: Územně plánovací informace nebo územní souhlas nebo územní rozhodnutí. Za stavební pozemek lze považovat pozemek, který je dle územního plánu určen k výstavbě a musí k němu být přivedeny všechny potřebné inženýrské sítě.",null,null,null,null,"Žádost",null,"účel - koupě"]
[null,null,"Vyčíslení úvěru prodávajícího určeného k refinancování. Pokud nebude úvěr prodávajícího doplacen celý, pak závazný příslib vzdání se zástavního práva. Pokud součástí vyčíslení není souhlas se zástavou nemovitosti a s jejím prodejem, pak i oznámení prodávajícího původnímu věřiteli.",null,null,null,null,"Žádost",null,"účel - koupě"]
[null,null,"Koupě bytu, který není zapsán v LV: Prohlášení vlastníka /smlouva o výstavbě",null,null,null,null,"Zpracování smluv. dokumentace",null,"účel - koupě"]
[null,null,"Výpis z KN budovy, ve které se nachází družstevní byt (ne starší 3 měsíce)",null,null,null,null,"Žádost",null,"účel - koupě / úhrada družstevního podílu"]
[null,null,"Smlouvu o budoucím převodu družstevního podílu (k Žádosti minimálně návrh smlouvy, ke zpracování sml. dokumentace vždy podepsaná smlouva)",null,null,null,null,"Žádost",null,"účel - koupě družstevního podílu"]
[null,null,"Doklad o členství převodce v bytovém družstvu, např. Potvrzení bytového družstva o členství převodce v družstvu, nájemní smlouva na družstevní byt, případně smlouva o převodu družstevního podílu od předchozího člena",null,null,null,null,"Žádost",null,"účel - koupě družstevního podílu"]
[null,null,"Minimálně návrh Nájemní smlouvy mezi družstvem a nájemníkem - členem družstva",null,null,null,null,"Žádost",null,"účel - úhrada družstevního podílu"]
[null,null,"Smlouva o úvěru / půjčce/ zápůjčce ",null,null,null,null,"Žádost",null,"účel - splacení dřívějšího úvěru"]
[null,null,"V případě úvěru/půjčky/zápůjčky od nebankovního subjektu: Příjmový doklad o přijetí částky úvěru/půjčky/zápůjčky v hotovosti (u úvěrů/zápůjčky poskytnuté po 1.12.2014 lze akceptovat pouze v případě částky do 270.000,- Kč včetně). Pro případy před 1.12.2014 platil judikát, který výši hotovostní platby neomezoval.",null,null,null,null,"Žádost",null,"účel - splacení dřívějšího úvěru"]
[null,null,"Výpis z KN financované nemovitosti (ne starší 3 měsíce)",null,null,null,null,"Žádost",null,"účel - zpětné proplacení vl. finančních prostředků"]
[null,null,"K účelu koupě: Kupní smlouva s potvrzením KÚ o provedení vkladu vlastnického práva / případně s vyrozuměním KÚ o provedení vkladu",null,null,null,null,"Žádost",null,"účel - zpětné proplacení vl. finančních prostředků"]
[null,null,"K účelu výstavba, rekonstrukce, modernizace: Faktura/faktury, oznámení o užívání stavby, příp. kolaudační souhlas, nebo Zpráva o stavu výstavby (min. 95% dokončenost stavebních prací).",null,null,null,null,"Žádost",null,"účel - zpětné proplacení vl. finančních prostředků"]
[null,null,"Doklad o zaplacení investice  (např. výpis z účtu, doklad o zaplacení v hotovosti) - lze akceptovat v případě, že čátka hotovosti v jeden den činila max. 350.000,- Kč včetně, pokud byla  zaplacena do 30.11.2014  příp. že částka hotovosti v jeden den činila max. 270.000,- Kč včetně, pokud byla  zaplacena od 1.12.2014.",null,null,null,null,"Žádost",null,"účel - zpětné proplacení vl. finančních prostředků"]
[null,null,"Po rozvodu manželství: \n- Pravomocné rozhodnutí soudu o zániku manželství rozvodem\n- Doklad o vypořádání SJM\n- Doklad o určení výše výživného (jsou-li nezaopatřené děti)",null,null,null,null,"Žádost",null,"účel - vypořádání spoluvlastnických / dědických nároků"]
[null,null,"Po rozvodu manželství (před více než 3 lety a manželé nemají vypořádáno SJM): \n- Pravomocné rozhodnutí soudu o zániku manželství rozvodem (pouze pokud není z dokladu totožnosti zřejmé, že je klient rozvedený více než 3 roky). \n- Doklad o určení výše výživného (jsou-li nezaopatřené děti)",null,null,null,null,"Žádost",null,"účel - vypořádání spoluvlastnických / dědických nároků"]
[null,null,"Za trvání manželství: dohoda o modifikaci SJM notářským zápisem/ pravomocné rozhodnutí soudu o modifikaci SJM",null,null,null,null,"Žádost",null,"účel - vypořádání spoluvlastnických / dědických nároků"]
[null,null,"Pravomocné Rozhodnutí o dědictví schválené soudem a dohoda o finančním vyrovnání nebo Darovací smlouva se závazkem k vyrovnání, resp. Dohodou o finančním vyrovnání",null,null,null,null,"Žádost",null,"účel - vypořádání spoluvlastnických / dědických nároků"]
[null,null,"Dokument o existenci vlastních zdrojů klienta, banka akceptuje dvě varianty prokázání:\nVšechny vlastní zdroje proinvestované před zahájením čerpání úvěru: \n•  žadatel nemusí jejich existenci prokazovat. Před 1. čerpáním úvěru musí prokázat takové procento rozestavěnosti, které prokáže proinvestování vlastních zdrojů.\nPostupné použití vlastních zdrojů v průběhu čerpání úvěru:\n•  žadatel musí prokázat použití 100% vlastních zdrojů po vyčerpání 50% části úvěru určeného právě na výstavbu/rekonstrukci;\n•  žadatel musí jejich existenci prokázat ke schválení úvěru (vč. doložení zdrojů, které bude mít k dispozici v budoucnu).",null,null,null,null,"Žádost",null,"účel - výstavba / rekonstrukce"]
[null,null,"Výstavba montovaných domů: návrh smlouvy/smlouvy o smlouvě budoucí o dílo",null,null,null,null,"Žádost",null,"účel - výstavba"]
[null,null,"Pokud se jedná o koupi bytu, prohlášení vlastníka /smlouva o výstavbě - výstavba bytu, který není zapsán v LV.",null,null,null,null,"Zpracování zást.smlouvy",null,"účel - výstavba"]
[null,null,"Přehledu zdrojů pro financování nákladů stavby (rozpočet)",null,null,null,null,"Žádost",null,"účel - rekonstrukce"]
[null,null,"Smlouva uzavřená s družstvem, ze které vyplývá výše členského vkladu (pozn. Zajištění musí být vždy jinou nemovitostí)",null,null,null,null,"Žádost",null,"účel - výzva družstva k úhradě"]
[null,null,"Stanovy družstva",null,null,null,null,"Žádost",null,"účel - výzva družstva k úhradě"]
[null,null,"Doklady prokazující totožnost a rodinný stav zástavce (pokud není zřejmý z dokladu totožnosti, doložte výpis z rejstříku obyvatel). Pro zpracování žádosti je nutné, aby byl zástavce existujícím klientem banky = měl přiřazené NDG",null,null,null,null,"Žádost",null,"zajištění"]
[null,null,"Je-li účelem úvěru refinancování úvěru, je možné  předložit původní odhad nemovitosti, na jehož základě byl refinancovaný  úvěr poskytnut nebo může být předložena původní kupní smlouva, na jejímž základě byla  nemovitost pořízena (pouze je-li úvěr zajištěn bytovou jednotkou). ",null,null,null,null,"Žádost",null,"zajištění"]
[null,null,"Návrh Dohody o jistotním účtu zřízeném u UCBCZ&SK ",null,null,null,null,"Schválení"]
[null,null,"Prohlášení manžela (souhlas se zástavou)",null,null,null,null,"Čerpání"]
[null,null,"Smlouva o zřízení zástavního práva k nemovitosti",null,null,null,null,"Čerpání"]
[null,null,"Návrh na vklad zástavního práva vztahující se k předmětu zástavy (s razítkem KÚ potvrzujícím přijetí Návrhu)",null,null,null,null,"Čerpání"]
[null,null,"Výpis z KN vztahující se k předmětu zástavy prokazující bankou požadovaný právní stav (aktuální = ne starší 30 dnů před čerpáním)\n- v případě bytové jednotky musí být předložen výpis z KN nejen k bytu, ale i k domu, ve kterém se byt nachází, event. pozemku (je-li vlastník odlišný od vlastníka byt.jednotky)",null,null,null,null,"Čerpání"]
[null,null,"Smlouva o pojištění zastavované nemovitosti - budovy/bytu včetně pojistných podmínek ",null,null,null,null,"Čerpání"]
[null,null,"Doklad o právně zajištěném přístupu k zastavené nemovitosti,\nKoupě z develop. projektu: Není-li do doby čerpání k dispozici může být nahrazen Prohlášením zástavce.",null,null,null,null,"Čerpání"]
[null,null,"Kolaudační souhlas / Oznámení o užívání stavby (může být vyžadováno pro poslední čerpání) nebo Zpráv o stavu výstavby prokazující dokončení stavby alespoň  z 95%",null,null,null,null,"Čerpání"]
[null,null,"Žádost o státní příspěvek",null,null,null,null,"Čerpání"]
[null,null,"Čestné prohlášení",null,null,null,null,"Čerpání"]
[null,null,"Údaje o dalších pozemcích",null,null,null,null,"Čerpání"]
[null,null,"Potvrzením příslušné finanční instituce o doplacení dluhu / resp. zrušení úvěrového produktu",null,null,null,null,"Čerpání"]
[null,null,"Potvrzení od Finančního úřadu o stavu osobního účtu (bezdlužnost)**\n- originál nebo dokument zkonvertovaný z elektronické verze vč. CzechPoint verifikace\n- nesmí být evidovány žádné nedoplatky, splátkové kalendáře ani posečkání s daňovou povinností",null,null,null,null,"Čerpání"]
[null,null,"Potvrzení od Finančního úřadu o stavu osobního účtu (bezdlužnost)**\n-  originál nebo dokument zkonvertovaný z elektronické verze vč. CzechPoint verifikace\n- nesmí být evidovány žádné nedoplatky, splátkové kalendáře ani posečkání s daňovou povinností",null,null,null,null,"Čerpání"]
[null,null,"Potvrzení od Finančního úřadu o stavu osobního účtu (bezdlužnost)**\n -  originál nebo dokument zkonvertovaný z elektronické verze vč. CzechPoint verifikace\n- nesmí být evidovány žádné nedoplatky, splátkové kalendáře ani posečkání s daňovou povinností",null,null,null,null,"Čerpání"]
[null,null,"Potvrzení od Finančního úřadu o stavu osobního účtu (bezdlužnost), dokládá-li klient existující příjmy daňovým přiznáním\n- originál nebo dokument zkonvertovaný z elektronické verze vč. CzechPoint verifikace",null,null,null,null,"čerpání"]
[null,null,"Uzavřená smlouva o budoucí kupní smlouvě, event. kupní smlouva. Podepsaná smlouva se musí s návrhem smlouvy předložené ke schválení úvěru shodovat minimálně v těchto ustanoveních:\n- identifikace smluvních stran;\n- předmět kupní smlouvy (identifikace nemovitosti);\n- výše kupní ceny a způsob jejího vypořádání;\n- zástavní práva, věcná břemena a jiná omezení vlastnického práva.",null,null,null,null,"Čerpání"]
[null,null,"Čerpání prostřednictvím not., advok. úschovy/jistotního účtu: Uzavřená smlouva o jistotním účtu, advokátní či notářské úschově (resp. protokol o úschově) nebo úschově realitní kanceláře. Podepsaná smlouva se musí s návrhem smlouvy předložené ke schválení úvěru shodovat minimálně v těchto ustanoveních:\n- identifikace smluvních stran;\n- předmět úschovy;\n- podmínky vyplacení prostředků z úschovy.",null,null,null,null,"Čerpání"]
[null,null,"Koupě z developerského projektu: Doklad o konečné kupní ceně",null,null,null,null,"Čerpání"]
[null,null,"Koupě z developerského projektu: Zpráva o stavu výstavby",null,null,null,null,"Čerpání"]
[null,null,"Koupě pozemku (samotného): Kolaudační souhlas s inženýrskými sítěmi k hranici pozemku",null,null,null,null,"Čerpání"]
[null,null,"Návrh na vklad převodu vlastnického práva",null,null,null,null,"Čerpání"]
[null,null,"Doložení právně zajištěného přístupu k zastavené nemovitosti",null,null,null,null,"Čerpání"]
[null,null,"Potvrzení o úhradě části kupní ceny financované z vlastních zdrojů (např. výpis z účtu, doklad o zaplacení v hotovosti - lze akceptovat pouze v případě částky do 350.000,- Kč  včetně)",null,null,null,null,"Čerpání"]
[null,null,"Dohoda o jistotním účtu zřízeném u UCBCZ&SK ",null,null,null,null,"Čerpání"]
[null,null,"Dokument, na základě kterého dochází k úschově finančních prostředků v notářské / advokátní úschově",null,null,null,null,"Čerpání"]
[null,null,"Smlouva o převodu družstevního podílu, vč. doložení skutečnosti, že smlouva byla předložena družstvu (např. vyznačením na smlouvě)",null,null,null,null,"Čerpání"]
[null,null,"Nájemní smlouva mezi družstvem a nájemníkem - členem družstva (nebyla-li předložena k žádosti)",null,null,null,null,"Čerpání"]
[null,null,"Výzva družstva k úhradě členského podílu",null,null,null,null,"Čerpání"]
[null,null,"Doklad o úhradě části nákladů financované z vlastních zdrojů  (např. výpis z účtu, doklad o zaplacení v hotovosti - lze akceptovat pouze v případě částky do 350.000,- Kč  včetně)",null,null,null,null,"Čerpání"]
[null,null,"Vyčíslení aktuálního zůstatku včetně příslušenství a Příslib výmazu zástavního práva, minimálně stanovenou podmínkou zániku pohledávky za dlužníkem ",null,null,null,null,"Čerpání"]
[null,null,"Souhlas se zatížením příp. i zcizením od původního věřitele, je-li tímto nemovitost zatížena. Pokud se jedná o absolutní zákaz zatížení (kdy na LV není uvedeno \"bez souhlasu banky\"), musí být nejdříve vymazán a až poté je možné zřídit zástavní právo Banky .",null,null,null,null,"Čerpání"]
[null,null,"Doklad o úhradě části nákladů financované z vlastních zdrojů  (např. výpis z účtu)",null,null,null,null,"Čerpání"]
[null,null,"Doklad o úhradě části nákladů financované z vlastních zdrojů  (např. výpis z účtu, doklad o zaplacení v hotovosti)",null,null,null,null,"Čerpání"]
[null,null,"Dohoda o vypořádání podílového spoluvlastnictví",null,null,null,null,"Čerpání"]
[null,null,"Doklad, na základě kterého je klient oprávněn zahájit stavbu (některý z těchto dokumentů):\n- Souhlas stavebního úřadu s provedením stavby\n- Certifikát vydaný autorizovaným inspektorem \n- Veřejnoprávní smlouva\n- Stavební povolení",null,null,null,null,"Čerpání"]
[null,null,"Smlouva o dílo ",null,null,null,null,"Čerpání"]
[null,null,"Zpráva o stavu výstavby v závislosti na aktuální hodnotě nemovitosti",null,null,null,null,"Čerpání"]
[null,null,"Pro poslední čerpání částky určené na výstavbu: \nOznámení o užívání stavby / Kolaudační souhlas nebo Zpráva o stavu výstavby (min. 95% rozestavěnost)",null,null,null,null,"Čerpání"]
[null,null,"Smlouva o dílo ",null,null,null,null,"Čerpání"]
[null,null,"Pro poslední čerpání částky určené na výstavbu: \nOznámení o užívání stavby / Kolaudační souhlas nebo Zpráva o stavu výstavby (min. 95% dokončenost stavebních prací)",null,null,null,null,"Čerpání"]
[null,null,"Souhlas valné hromady se zastavením a s převodem nemovitosti/ souhlas členské schůze družstva formou notářského zápisu",null,null,null,null,"Čerpání"]
[null,null,"Výpis z rejstříku zástav, že není zastaven závod obchodní korporace",null,null,null,null,"Čerpání"]
[null,null,"Smlouva o životním pojištění včetně pojistných podmínek",null,null,null,null,"Čerpání"]
[null,null,"Smlouva o postoupení pohledávek z životního pojištění",null,null,null,null,"Čerpání"]
[null,null,"Smlouva o postoupení pohledávek z termínovaného vkladu vedeného u Banky",null,null,null,null,"Čerpání"]
[null,null,"Dohoda se svolením k vykonatelnosti formou notářského zápisu",null,null,null,null,"Čerpání"]

{"sheet":"Doplneni","index":11,"n_rows":621,"n_cols":54,"rows_kept":621,"cut":false,"hidden":false,"merged":[[363,37,363,51],[14,45,14,51],[540,2,540,52],[538,2,538,52],[532,2,532,52],[13,9,13,24],[14,27,14,40],[16,1,16,52],[20,2,20,7],[20,13,20,18],[20,28,20,33],[20,39,20,44],[50,24,50,42],[56,2,56,25],[56,28,56,51],[62,3,62,5],[62,29,62,31],[65,9,65,25],[65,35,65,51],[66,9,66,17],[66,35,66,43],[58,2,58,4],[58,16,60,19],[58,21,60,24],[58,28,58,30],[58,42,60,45],[2,0,2,12],[6,11,6,15],[6,16,6,17],[10,27,10,40],[11,9,11,24],[12,9,12,24],[28,2,28,18],[28,28,28,44],[47,2,47,25],[47,28,47,51],[22,2,22,25],[22,28,22,51],[24,2,24,25],[24,28,24,51],[26,2,26,18],[26,28,26,44],[58,47,60,50],[74,16,74,19],[74,42,74,45],[78,16,78,23],[78,42,78,49],[82,16,82,23],[82,42,82,49],[67,9,67,25],[67,35,67,51],[72,16,72,23],[72,42,72,49],[73,16,73,19],[73,42,73,45],[90,2,90,11],[91,2,91,10],[91,14,91,22],[91,28,91,36],[91,40,91,48],[93,14,93,19],[93,40,93,45],[84,16,84,23],[84,42,84,49],[86,16,86,23],[86,42,86,49],[88,16,88,23],[88,42,88,49],[95,2,95,13],[95,14,95,19],[95,20,95,25],[95,28,95,39],[95,40,95,45],[95,46,95,51],[94,2,94,13],[94,14,94,19],[94,20,94,25],[94,28,94,39],[94,40,94,45],[94,46,94,51],[99,14,99,19],[99,40,99,45],[103,17,103,19],[103,23,103,32],[128,6,128,19],[132,2,132,51],[96,14,96,19],[96,40,96,45],[97,14,97,19],[97,40,97,45],[98,2,98,13],[98,14,98,19],[98,28,98,39],[98,40,98,45],[194,2,194,51],[195,2,195,51],[198,28,199,51],[200,28,200,51],[203,28,204,51],[144,13,144,51],[156,13,156,22],[156,40,156,49],[170,13,170,51],[192,2,192,51],[193,2,193,51],[204,14,204,25],[204,2,204,11],[152,13,152,37],[148,13,148,22],[150,13,150,22],[154,13,154,22],[160,23,160,49],[162,23,162,49],[174,13,174,22],[176,13,176,22],[178,13,178,37],[180,13,180,22],[182,13,182,22],[214,27,214,40],[215,9,215,24],[216,9,216,24],[217,9,217,24],[218,27,218,40],[220,1,220,52],[205,28,205,51],[208,2,208,25],[208,28,208,39],[208,40,208,51],[210,2,210,11],[210,14,210,25],[228,2,228,25],[228,28,228,51],[230,2,230,18],[230,28,230,44],[232,2,232,18],[232,28,232,44],[224,2,224,7],[224,13,224,18],[224,28,224,33],[224,39,224,44],[226,2,226,25],[226,28,226,51],[251,2,251,25],[251,28,251,51],[254,24,254,42],[260,2,260,25],[260,28,260,51],[262,2,262,4],[262,16,264,19],[262,21,264,24],[262,28,262,30],[262,42,264,45],[271,9,271,25],[271,35,271,51],[276,16,276,23],[276,42,276,49],[277,16,277,19],[277,42,277,45],[262,47,264,50],[266,3,266,5],[266,29,266,31],[269,9,269,25],[269,35,269,51],[270,9,270,17],[270,35,270,43],[288,16,288,23],[288,42,288,49],[290,16,290,23],[290,42,290,49],[292,16,292,23],[292,42,292,49],[278,16,278,19],[278,42,278,45],[282,16,282,23],[282,42,282,49],[286,16,286,23],[286,42,286,49],[298,28,298,39],[298,40,298,45],[298,46,298,51],[294,2,294,11],[295,2,295,10],[295,14,295,22],[295,28,295,36],[295,40,295,48],[297,14,297,19],[297,40,297,45],[298,20,298,25],[298,2,298,13],[298,14,298,19],[386,2,386,51],[387,2,387,51],[303,14,303,19],[303,40,303,45],[307,17,307,19],[307,23,307,32],[323,6,323,19],[327,2,327,51],[383,23,383,49],[365,13,365,51],[369,13,369,22],[371,13,371,22],[373,13,373,37],[375,13,375,22],[377,13,377,22],[377,40,377,49],[381,23,381,49],[339,13,339,51],[343,13,343,22],[345,13,345,22],[347,13,347,37],[349,13,349,22],[351,13,351,22],[351,40,351,49],[399,28,399,51],[402,2,402,25],[402,28,402,39],[402,40,402,51],[404,2,404,11],[404,14,404,25],[388,2,388,51],[389,2,389,51],[392,28,393,51],[394,28,394,51],[397,28,398,51],[398,2,398,25],[421,4,421,49],[422,8,422,36],[422,37,423,44],[423,8,423,36],[424,8,424,36],[424,37,425,44],[425,8,425,36],[408,1,408,52],[411,1,411,52],[414,1,414,52],[415,1,415,52],[416,1,416,52],[417,1,417,52],[426,8,426,36],[426,37,428,44],[427,8,427,36],[428,8,428,36],[435,7,438,14],[435,15,438,22],[435,23,438,29],[435,30,438,37],[435,38,438,45],[450,1,450,52],[452,1,452,52],[453,1,453,52],[455,1,455,52],[456,1,456,52],[458,1,458,52],[443,28,444,51],[445,28,445,51],[446,5,446,7],[447,1,447,52],[448,1,448,52],[449,1,449,52],[467,1,467,52],[469,1,469,52],[470,1,470,52],[472,1,472,52],[473,1,473,3],[474,1,474,3],[459,1,459,52],[460,1,460,52],[462,1,462,52],[463,1,463,52],[464,1,464,52],[466,1,466,52],[481,1,481,52],[482,1,482,3],[483,1,483,52],[484,1,484,3],[485,1,485,52],[486,1,486,52],[475,1,475,52],[476,1,476,3],[477,1,477,52],[478,1,478,3],[479,1,479,52],[480,1,480,3],[496,27,496,50],[499,27,500,50],[500,1,500,24],[501,27,501,50],[505,26,505,52],[487,1,487,3],[488,1,488,52],[489,1,489,3],[490,1,490,52],[491,1,491,3],[494,27,495,50],[503,1,503,52],[559,3,559,52],[561,1,561,35],[563,3,563,10],[563,12,563,13],[563,14,563,18],[563,20,563,32],[537,2,537,52],[539,2,539,52],[544,2,544,52],[547,2,547,52],[548,2,548,52],[550,2,550,52],[554,1,554,52],[556,1,556,52],[557,2,557,12],[557,17,557,24],[557,27,557,36],[553,1,553,52],[552,1,552,52],[551,2,551,52],[549,2,549,52],[543,2,543,52],[542,2,542,52],[541,2,541,52],[621,1,621,32],[564,20,564,32],[568,26,568,52],[566,1,566,52],[596,2,596,52],[598,2,598,52],[603,2,603,52],[606,2,606,52],[607,2,607,52],[609,2,609,52],[613,1,613,52],[615,1,615,52],[619,2,619,12],[619,17,619,24],[619,27,619,36],[591,2,591,52],[610,2,610,52],[612,1,612,52],[583,2,583,52],[585,1,585,52],[599,2,599,52],[600,2,600,52],[602,2,602,52],[333,2,333,51],[138,2,138,51],[168,37,168,51],[355,23,355,49],[357,23,357,49],[130,6,130,19],[325,6,325,19],[182,40,182,49],[186,23,186,49],[188,23,188,49],[300,14,300,19],[300,40,300,45],[301,14,301,19],[301,40,301,45],[302,2,302,13],[302,14,302,19],[302,28,302,39],[302,40,302,45],[299,2,299,13],[299,14,299,19],[299,20,299,25],[299,28,299,39],[299,40,299,45],[299,46,299,51]]}
[]
[]
["DOPLNĚNÍ ŽÁDOSTI",null,null,null,null,null,null,null,null,null,null,null,null,null,null,null,null,null,null,null,null,null,null,null,null,null,null,null,null,null,null,null,null,null,null,null,null,null,null,null,null,null,null,null,null,null,null,null,null,null,null,null,null,{"$f":"manVerze","v":"v.14a"}]
[]
[]
[]
[null,null,null,null,null,null,null,null,null,null,null,"Počet žatadelů",null,null,null,null,1]
[]
[]
[]
[null,null,"Vyplní Banka",null,null,null,null,null,null,null,null,null,null,null,null,null,null,null,null,null,null,null,null,null,null,null,null,"Datum převzetí KOMPLETNÍ dokumentace "]
[null,null,"Pracovník banky:",null,null,null,null,null,null,{"$f":"IF(zPracovnikBanky=\"\",\"\",zPracovnikBanky)","v":""}]
[null,null,"Pobočka (číslo):",null,null,null,null,null,null,{"$f":"IF(zPobocka=\"\",\"\",zPobocka)","v":""}]
[null,null,"NDG klientů:",null,null,null,null,null,null,{"$f":"IF(zNdg=\"\",\"\",zNdg)","v":""}]
[null,null,null,null,null,null,null,null,null,null,null,null,null,null,null,null,null,null,null,null,null,null,null,null,null,null,null,"razítko \"Doručeno dne\"",null,null,null,null,null,null,null,null,null,null,null,null,null,null,"Verze:",null,null,1]
[]
[null,"DOPLŇUJÍCÍ INFORMACE K ŽÁDOSTI O POSKYTNUTÍ HYPOTEČNÍHO ÚVĚRU"]
[null,null,"Vyplní klient"]
[null,null,"ŽADATEL",null,null,null,null,null,null,null,null,null,null,null,null,null,null,null,null,null,null,null,null,null,null,null,null,null,"SPOLUŽADATEL"]
[null,null,"Titul před jménem",null,null,null,null,null,null,null,null,null,null,"Titul za jménem",null,null,null,null,null,null,null,null,null,null,null,null,null,null,"Titul před jménem",null,null,null,null,null,null,null,null,null,null,"Titul za jménem"]
[]
[null,null,"Jméno",null,null,null,null,null,null,null,null,null,null,null,null,null,null,null,null,null,null,null,null,null,null,null,null,null,"Jméno"]
[null,null,{"$f":"IF(SplatkaJmenoKlienta=0,\"\",SplatkaJmenoKlienta)","v":""},null,null,null,null,null,null,null,null,null,null,null,null,null,null,null,null,null,null,null,null,null,null,null,null,null,{"$f":"IF(zadJmeno2=0,\"\",zadJmeno2)","v":""}]
[null,null,"Příjmení",null,null,null,null,null,null,null,null,null,null,null,null,null,null,null,null,null,null,null,null,null,null,null,null,null,"Příjmení"]
[null,null,{"$f":"IF(SplPrijmeniKlienta=0,\"\",SplPrijmeniKlienta)","v":""},null,null,null,null,null,null,null,null,null,null,null,null,null,null,null,null,null,null,null,null,null,null,null,null,null,{"$f":"IF(zadPrijmeni2=0,\"\",zadPrijmeni2)","v":""}]
[null,null,"Rodné číslo / u cizinců datum narození",null,null,null,null,null,null,null,null,null,null,null,null,null,null,null,null,null,null,null,null,null,null,null,null,null,"Rodné číslo / u cizinců datum narození"]
[null,null,{"$f":"IF(zadRC=0,\"\",zadRC)","v":""},null,null,null,null,null,null,null,null,null,null,null,null,null,null,null,null,null,null,null,null,null,null,null,null,null,{"$f":"IF(zadRC2=0,\"\",zadRC2)","v":""}]
[null,null,"Státní příslušnost",null,null,null,null,null,null,null,null,null,null,null,null,null,null,null,null,null,null,null,null,null,null,null,null,null,"Státní příslušnost"]
[]
[null,null,"Rodinný stav",null,null,null,null,null,null,null,null,null,null,null,null,"Vzdělání",null,null,null,null,null,null,null,null,null,null,null,null,"Rodinný stav",null,null,null,null,null,null,null,null,null,null,null,null,"Vzdělání"]
[null,null,null," Svobodný/svobodná",null,null,null,null,null,null,null,null,null,null,null,null,"VŠ",null,null,null,null,null,null,null,null,null,null,null,null," Svobodný/svobodná",null,null,null,null,null,null,null,null,null,null,null,null,"VŠ"]
[]
[null,null,null," Ženatý/vdaná",null,null,null,null,null,null,null,null,null,null,null,null,"Vyšší odborné",null,null,null,null,null,null,null,null,null,null,null,null," Ženatý/vdaná",null,null,null,null,null,null,null,null,null,null,null,null,"Vyšší odborné"]
[]
[null,null,null,null,"SJM zúženo",null,null,null,null,null,null,null,null,null,null,null,"SŠ s maturitou",null,null,null,null,null,null,null,null,null,null,null,null,null,"SJM zúženo",null,null,null,null,null,null,null,null,null,null,null,"SŠ s maturitou"]
[]
[null,null,null,null,"oddělená jmění",null,null,null,null,null,null,null,null,null,null,null,"OU s maturitou",null,null,null,null,null,null,null,null,null,null,null,null,null,"oddělená jmění",null,null,null,null,null,null,null,null,null,null,null,"OU s maturitou"]
[]
[null,null,null," Rozvedený/rozvedená",null,null,null,null,null,null,null,null,null,null,null,null,"OU",null,null,null,null,null,null,null,null,null,null,null,null," Rozvedený/rozvedená",null,null,null,null,null,null,null,null,null,null,null,null,"OU"]
[]
[null,null,null,null,"méně než 3 let",null,null,null,null,null,null,null,null,null,null,null,"Základní",null,null,null,null,null,null,null,null,null,null,null,null,null,"méně než 3 let",null,null,null,null,null,null,null,null,null,null,null,"Základní"]
[]
[null,null,null,null,"více než 3 let",null,null,null,null,null,null,null,null,null,null,null,null,null,null,null,null,null,null,null,null,null,null,null,null,null,"více než 3 let"]
[]
[null,null,null," Vdovec/vdova",null,null,null,null,null,null,null,null,null,null,null,null,null,null,null,null,null,null,null,null,null,null,null,null,null," Vdovec/vdova"]
[]
[null,null,null," Registrovaný partner",null,null,null,null,null,null,null,null,null,null,null,null,null,null,null,null,null,null,null,null,null,null,null,null,null," Registrovaný partner"]
[null,null,"Zvláštní vztah k UniCredit Bank Czech Republic and Slovakia, a.s. podle zákona o bankách 1)",null,null,null,null,null,null,null,null,null,null,null,null,null,null,null,null,null,null,null,null,null,null,null,null,null,"Zvláštní vztah k UniCredit Bank Czech Republic and Slovakia, a.s. podle zákona o bankách 1)"]
[null,null,null,"Ano",null,null,"Ne",null,null,null,null,null,null,null,null,null,null,null,null,null,null,null,null,null,null,null,null,null,null,"Ano",null,null,"Ne"]
[]
[null,null,null,null,null,null,null,null,null,null,null,"Jaký je vztah žadatele a spolužadatele?"]
[null,null,"Bytové poměry",null,null,null,null,null,null,null,null,null,null,null,null,null,null,null,null,null,null,null,null,null,null,null,null,null,"Bytové poměry"]
[null,null,null,"Vlastnictví domu/bytu",null,null,null,null,null,null,null,null,null,"Nájem",null,null,null,null,null,"Bydlení s rodiči",null,null,null,null,null,null,null,null,null,"Vlastnictví domu/bytu",null,null,null,null,null,null,null,null,null,"Nájem",null,null,null,null,null,"Bydlení s rodiči"]
[]
[null,null,null,"Právo k užívání družstevního domu/bytu",null,null,null,null,null,null,null,null,null,null,null,null,null,null,null,"Jiné",null,null,null,null,null,null,null,null,null,"Právo k užívání družstevního domu/bytu",null,null,null,null,null,null,null,null,null,null,null,null,null,null,null,"Jiné"]
[null,null,"Bydliště (adresa skutečného pobytu, je-li odlišná od trvalého pobytu)",null,null,null,null,null,null,null,null,null,null,null,null,null,null,null,null,null,null,null,null,null,null,null,null,null,"Bydliště (adresa skutečného pobytu, je-li odlišná od trvalého pobytu)"]
[]
[null,null,"Délka skutečného pobytu (v letech)",null,null,null,null,null,null,null,null,null,null,null,null,"Korespondenční adresa",null,null,null,null,null,null,null,null,null,null,null,null,"Délka skutečného pobytu (v letech)",null,null,null,null,null,null,null,null,null,null,null,null,"Korespondenční adresa"]
[null,null,null,null,null,null,null,null,null,null,null,null,null,null,null,null,"Adresa trvalého pobytu",null,null,null,null,"Adresa bydliště",null,null,null,null,null,null,null,null,null,null,null,null,null,null,null,null,null,null,null,null,"Adresa trvalého pobytu",null,null,null,null,"Adresa bydliště"]
[]
[null,null,"Cizí státní příslušník ",null,null,null,null,null,null,null,null,null,null,null,null,null,null,null,null,null,null,null,null,null,null,null,null,null,"Cizí státní příslušník "]
[null,null,null,"Délka pobytu v ČR (v letech)",null,null,null,null,null,null,null,null,null,null,null,"Pobyt v ČR",null,null,null,null,null,null,null,null,null,null,null,null,null,"Délka pobytu v ČR (v letech)",null,null,null,null,null,null,null,null,null,null,null,"Pobyt v ČR"]
[null,null,null,null,null,null,null,null,null,null,null,null,null,null,null,null,"Trvalý",null,null,null,null,"Přechodný",null,null,null,null,null,null,null,null,null,null,null,null,null,null,null,null,null,null,null,null,"Trvalý",null,null,null,null,"Přechodný"]
[]
[]
[null,null,"Zaměstnavatel",null,null,null,null,null,null,null,null,null,null,null,null,null,null,null,null,null,null,null,null,null,null,null,null,null,"Zaměstnavatel"]
[null,null,"IČ",null,null,null,null,null,null,null,null,null,null,null,null,null,null,null,null,null,null,null,null,null,null,null,null,null,"IČ"]
[null,null,"Pracovní pozice",null,null,null,null,null,null,null,null,null,null,null,null,null,null,null,null,null,null,null,null,null,null,null,null,null,"Pracovní pozice"]
[]
[null,null,"Hlavní zdroj příjmu 2)",null,null,null,null,null,null,null,null,null,null,null,null,null,null,null,null,null,null,null,null,null,null,null,null,null,"Hlavní zdroj příjmu"]
[null,null,null,null,"závislá činnost",null,null,null,null,null,null,null,null,null,null,null,null,"v ČR",null,null,"v zahraničí",null,null,null,null,null,null,null,null,null,"závislá činnost",null,null,null,null,null,null,null,null,null,null,null,null,"v ČR",null,null,"v zahraničí"]
[]
[null,null,null,null,null,null,null,null,null,null,null,null,null,null,null,null,{"$f":"IF(ZavislaVysledny=\"\",\"\",ZavislaVysledny)","v":""},null,null,null,null,null,null,null,"Kč",null,null,null,null,null,null,null,null,null,null,null,null,null,null,null,null,null,{"$f":"IF(SpoZavislaVysledny=\"\",\"\",SpoZavislaVysledny)","v":""},null,null,null,null,null,null,null,"Kč"]
[null,null,null,null,null,"délka současného prac. poměru",null,null,null,null,null,null,null,null,null,null,null,null,null,null,null,"v letech",null,null,null,null,null,null,null,null,null,"délka současného prac. poměru",null,null,null,null,null,null,null,null,null,null,null,null,null,null,null,"v letech"]
[null,null,null,null,null,"délka předchozího prac. poměru",null,null,null,null,null,null,null,null,null,null,null,null,null,null,null,"v letech",null,null,null,null,null,null,null,null,null,"délka předchozího prac. poměru",null,null,null,null,null,null,null,null,null,null,null,null,null,null,null,"v letech"]
[]
[null,null,null,null,null,"zkušební / výpovědní doba 3)",null,null,null,null,null,null,null,null,null,null,null,"Ano",null,null,"Ne",null,null,null,null,null,null,null,null,null,null,"zkušební / výpovědní doba 3)",null,null,null,null,null,null,null,null,null,null,null,"Ano",null,null,"Ne"]
[]
[null,null,null,null,"samostatně výdělečná činnost",null,null,null,null,null,null,null,null,null,null,null,null,null,null,null,null,null,null,null,"Kč",null,null,null,null,null,"samostatně výdělečná činnost",null,null,null,null,null,null,null,null,null,null,null,null,null,null,null,null,null,null,null,"Kč"]
[]
[null,null,null,null,null,"aktivní nepřetržitě min. 12 měsíců",null,null,null,null,null,null,null,null,null,null,null,"Ano",null,null,"Ne",null,null,null,null,null,null,null,null,null,null,"aktivní nepřetržitě min. 12 měsíců",null,null,null,null,null,null,null,null,null,null,null,"Ano",null,null,"Ne"]
[]
[null,null,null,null,"příjem z pronájmu",null,null,null,null,null,null,null,null,null,null,null,null,null,null,null,null,null,null,null,"Kč",null,null,null,null,null,"příjem z pronájmu",null,null,null,null,null,null,null,null,null,null,null,null,null,null,null,null,null,null,null,"Kč"]
[]
[null,null,null,null,"příjem z kapitálového majetku",null,null,null,null,null,null,null,null,null,null,null,null,null,null,null,null,null,null,null,"Kč",null,null,null,null,null,"příjem z kapitálového majetku",null,null,null,null,null,null,null,null,null,null,null,null,null,null,null,null,null,null,null,"Kč"]
[]
[null,null,null,null,"starobní důchod",null,null,null,null,null,null,null,null,null,null,null,null,null,null,null,null,null,null,null,"Kč",null,null,null,null,null,"starobní důchod",null,null,null,null,null,null,null,null,null,null,null,null,null,null,null,null,null,null,null,"Kč"]
[]
[null,null,null,null,"jiný",null,null,null,null,null,null,null,null,null,null,null,null,null,null,null,null,null,null,null,"Kč",null,null,null,null,null,"jiný",null,null,null,null,null,null,null,null,null,null,null,null,null,null,null,null,null,null,null,"Kč"]
[]
[null,null,"Počet dospělých  v domácnosti",null,null,null,null,null,null,null,null,null,null,null,"Počet dětí v domácnosti (do 26 let)",null,null,null,null,null,null,null,null,null,null,null,null,null,"Počet dospělých  v domácnosti",null,null,null,null,null,null,null,null,null,null,null,"Počet dětí v domácnosti (do 26 let)"]
[null,null,{"$f":"Dospeli","v":1},null,null,null,null,null,null,null,null,null,null,null,{"$f":"Deti","v":0}]
[]
[null,null,null,null,null,null,null,null,null,null,null,null,null,null,"jako spolu/žadatel",null,null,null,null,null,null,"jako ručitel",null,null,null,null,null,null,null,null,null,null,null,null,null,null,null,null,null,null,"jako spolu/žadatel",null,null,null,null,null,null,"jako ručitel"]
[null,null,"Hypoteční úvěr, úvěr ze stavebního spoření",null,null,null,null,null,null,null,null,null,null,null,null,null,null,null,null,null,null,null,null,null,null,null,null,null,"Hypoteční úvěr, úvěr ze stavebního spoření"]
[null,null,"Osobní úvěr, leasing, splátkový prodej, zápůjčka",null,null,null,null,null,null,null,null,null,null,null,null,null,null,null,null,null,null,null,null,null,null,null,null,null,"Osobní úvěr, leasing, splátkový prodej, zápůjčka"]
[null,null,"Kontokorentní úvěr (vč. nevyužívaných)",null,null,null,null,null,null,null,null,null,null,null,{"$f":"KTK","v":0},null,null,null,null,null,null,null,null,null,null,null,null,null,"Kontokorentní úvěr (vč. nevyužívaných)"]
[null,null,"Kreditní karta (vč. nevyužívaných)",null,null,null,null,null,null,null,null,null,null,null,{"$f":"KK","v":0},null,null,null,null,null,null,null,null,null,null,null,null,null,"Kreditní karta (vč. nevyužívaných)"]
[null,null,"Další pravidelné výdaje (výživné, spoření, pojištění)",null,null,null,null,null,null,null,null,null,null,null,{"$f":"VydOstatni+VydPojisteni","v":0},null,null,null,null,null,null,null,null,null,null,null,null,null,"Další pravidelné výdaje (výživné, spoření, pojištění)"]
[null,null,"Náklady na bydlení",null,null,null,null,null,null,null,null,null,null,null,null,null,null,null,null,null,null,null,null,null,null,null,null,null,"Náklady na bydlení"]
[]
[null,null,"SPECIFIKACE ÚVĚRU"]
[null,null,"Typ úrokové sazby",null,null,null,null,null,null,null,null,null,null,null,null,null,null,null,null,null,null,null,null,"Délka čerpání úvěru (v měsících) 6)",null,null,null,null,null,null,null,null,null,null,null,null,null,"Mám zájem o slevu na úrokové sazbě za:"]
[null,null,{"$f":"IF(Fix_obdobi=\"1 roky\",\"X\",IF(Fix_obdobi=\"2 roky\",\"X\",IF(Fix_obdobi=\"3 roky\",\"X\",IF(Fix_obdobi=\"5 let\",\"X\",IF(Fix_obdobi=\"7 let\",\"X\",IF(Fix_obdobi=\"10 let\",\"X\",\"\"))))))","v":"X"},"Fixní - délka fixace úrokové sazby (v letech) 4)",null,null,null,null,null,null,null,null,null,null,null,null,null,{"$f":"IF(LEFT(Fix_obdobi,2) <> \"Fl\",LEFT(Fix_obdobi,2),\"\")","v":"3 "},null,null,null,null,null,{"$f":"DatumDocerpani","v":0},null,null,null,null,null,null,null,null,null,null,null,null,null,{"$f":"IF(SlevaUcet = \"Ano\",\"X\",\"\")","v":"X"},"Aktivní běžný účet 8)"]
[]
[null,null,{"$f":"IF(Fix_obdobi=\"Float\",\"X\",\"\")","v":""},"Variabilní (Převratná hypotéka) 5)",null,null,null,null,null,null,null,null,null,null,null,null,null,null,null,null,null,null,null,null,null,null,null,null,null,null,null,null,null,null,null,null,null,{"$f":"IF(SlevaKarta = \"Ano\",\"X\",\"\")","v":"X"},"Aktivní kreditní kartu 9)"]
[]
[null,null,null,null,null,null,null,null,null,null,null,null,null,null,null,null,null,null,null,null,null,null,null,null,null,null,null,null,null,null,null,null,null,null,null,null,null,{"$f":"IF(SlevaCardif = \"Ano\",\"X\",\"\")","v":"X"},"Pojištění schopnosti splácet 7)"]
[]
[null,null,null,null,null,null,null,null,null,null,null,null,null,null,null,null,null,null,null,null,null,null,null,null,null,null,null,null,null,"Pojištěný",null,null,null,null,null,null,null,"Soubor pojištění"]
[null,null,null,null,null,null,null,null,null,null,null,null,null,null,null,null,null,null,null,null,null,null,null,null,null,null,null,null,null,null,"Hlavní žadatel",null,null,null,null,null,null,null,"JP A: Úmrtí a pracovní neschopnost"]
[]
[null,null,null,null,null,null,null,null,null,null,null,null,null,null,null,null,null,null,null,null,null,null,null,null,null,null,null,null,null,null,"Spolužadatel",null,null,null,null,null,null,null,"JP B: Úmrtí a ztráta zaměstnání"]
[]
[null,null,null,null,null,null,null,null,null,null,null,null,null,null,null,null,null,null,null,null,null,null,null,null,null,null,null,null,null,null,null,null,null,null,null,null,null,null,"JP C: Úmrtí a invalidita III. stupně"]
[]
[null,null,null,null,null,null,null,null,null,null,null,null,null,null,null,null,null,null,null,null,null,null,null,null,null,null,null,null,null,null,null,null,null,null,null,null,null,null,"měs.: Úmrtí, invalidita III. stupně a pracovní neschopnost"]
[null,null,"Účel úvěru"]
[null,null,{"$f":"IF(HlavUcelUveru=\"Koupě\",\"X\",\"\")","v":""},"Koupě ",null,null,null,null,null,null,null,null,null,null,null,null,null,null,null,null,null,null,null,null,null,null,null,null,null,"Typ úvěru"]
[]
[null,null,{"$f":"IF(HlavUcelUveru=\"Refinancování úvěru – zjednodušené\",\"X\",IF(HlavUcelUveru=\"Refinancování úvěru – standard\",\"X\",\"\"))","v":""},"Refinancování ",null,null,null,null,null,null,null,null,null,null,null,null,null,null,null,null,null,null,null,null,null,null,null,null,null,{"$f":"IF(TypHypoteky=\"Hypoteční úvěr účelový rezidenční Individual\",\"X\",\"\")","v":"X"},"INDIVIDUAL - Hypoteční úvěr účelový"]
[]
[null,null,{"$f":"IF(HlavUcelUveru=\"Výstavba\",\"X\",IF(HlavUcelUveru=\"Rekonstrukce\",\"X\",\"\"))","v":""},"Výstavba / Rekonstrukce",null,null,null,null,null,null,null,null,null,null,null,null,null,null,null,null,null,null,null,null,null,null,null,null,null,{"$f":"IF(TypHypoteky=\"Hypoteční úvěr účelový rezidenční Flexi\",\"X\",\"\")","v":""},"FLEXI - Hypoteční úvěr s možností předčasné splátky "]
[]
[null,null,{"$f":"IF(HlavUcelUveru=\"Vypořádání majetkových nároků\",\"X\",\"\")","v":""},"Vypořádání majetkových poměrů spojených s nemovitostí",null,null,null,null,null,null,null,null,null,null,null,null,null,null,null,null,null,null,null,null,null,null,null,null,null,{"$f":"IF(TypHypoteky=\"Hypoteční úvěr účelový rezidenční Twin\",\"X\",\"\")","v":""},"TWIN - Hypoteční úvěr s kombinací neúčelové části "]
[]
[null,null,{"$f":"IF(HlavUcelUveru=\"Zpětné proplacení vl. zdrojů\",\"X\",\"\")","v":""},"Zpětné proplacení finančních prostředků",null,null,null,null,null,null,null,null,null,null,null,null,null,null,null,null,null,null,null,null,null,null,null,null,null,{"$f":"IF(TypHypoteky=\"Hypoteční úvěr účelový nerezidenční\",\"X\",\"\")","v":""},"Hypoteční úvěr účelový nerezidenční"]
[]
[null,null,null,"Jiný ",null,null,{"$f":"IF(dopUcelUveru6=\"\",\"\",HlavUcelUveru)","v":""},null,null,null,null,null,null,null,null,null,null,null,null,null,null,null,null,null,null,null,null,null,null,{"$f":"IF(TypHypoteky=\"Hypoteční úvěr neúčelový\",\"X\",\"\")","v":""},"Hypoteční úvěr neúčelový"]
[]
[null,null,null,"Další účel"]
[]
[null,null,"1) Za osoby, které mají k bance zvláštní vztah, se podle § 19 zákona č. 21/1992 Sb., o bankách, považují a) členové statutárního orgánu a vedoucí zaměstnanci banky, b) členové dozorčí rady banky, c) právnické osoby mající kontrolu nad bankou, jejich hlavní akcionáři a členové vedení těchto společností, d) osoby blízké členům statutárního orgánu, dozorčí rady, vedoucím zaměstnancům banky a osobám majícím kontrolu nad bankou, e) právnické osoby, ve kterých některá z osob uvedených pod písmeny a), b) a c) má podíl na základním jmění přesahující 10 %, f) hlavní akcionáři banky a jakákoliv právnická osoba pod jejich kontrolou, g) členové bankovní rady České národní banky, h) právnické osoby, nad kterými má banka kontrolu."]
[null,null,"2) Výše čistého měsíčního příjmu za poslední 3 měsíce. U osoby samostatně výdělečně činné za posledních 12 kalendářních měsíců."]
[null,null,"3) Nehodící se škrtněte."]
[null,null,"4) Déka fixace úrokové sazby je počet let, po které bude fixní úroková sazba neměnná."]
[null,null,"5) Úroková sazba je složena z variabilní a fixní složky, tj. její celková výše se mění v závislosti na situaci na finančním trhu."]
[null,null,"6) Období čerpání (od podpisu smlouvy do ukončení čerpání)."]
[null,null,"7) Úvěrové životní pojištění s jednorázově splatným pojistným, délka pojištění je 5 let, pojištění pro případ úmrtí + pracovní neschopnosti / ztráty zaměstnání / invalidity III. stupně. "]
[null,null,"8) Platí i pro stávajícího klienta UniCredit Bank v případě, že již službu využívá."]
[null,null,"9) Rámec kreditní karty je schválen současně s úvěrem. Karta je poskytnuta za zvýhodněných podmínek. Sleva platí i pro již existující kreditní kartu."]
[null,null,"10) Podmínky objednání odhadu Vám budou sděleny pracovníkem Banky, resp. pověřeným zástupcem Banky."]
[]
[null,null,"FINANCOVANÁ NEMOVITOST 1)"]
[null,null,"Adresa nemovitosti"]
[]
[null,null,"Druh nemovitosti"]
[]
[null,null,null,"Byt - č. jednotky:"]
[]
[null,null,null,"Rodinný dům - č.p.:",null,null,null,null,null,null,null,null,null,null,null,null,null,null,null,null,null,null,null,null,null,"zděný",null,null,null,null,null,"montovaná dřevostavba"]
[]
[null,null,null,"Stavební pozemek - č.:"]
[]
[null,null,null,"Rekreační objekt - č.e./č.p.:",null,null,null,null,null,null,null,null,null,null,null,null,null,null,null,null,null,null,null,null,null,"chata",null,null,null,null,null,"chalupa"]
[]
[null,null,"Číslo listu vlastnictví",null,null,null,null,null,null,null,null,null,null,null,null,null,null,null,null,null,null,null,null,null,null,null,null,null,null,"Výše investice do nemovitosti"]
[]
[null,null,"Účel využití objektu úvěru",null,null,null,null,null,null,null,null,null,null,null,"vlastní bydlení (event. bydlení osoby blízké)",null,null,null,null,null,null,null,null,null,null,null,null,null,null,null,"rekreace",null,null,null,null,null,"pronájem"]
[]
[null,null,"Na nemovitosti vázne",null,null,null,null,null,null,null,null,null,null,null,"zástavní právo - prosím uveďte"]
[]
[null,null,null,null,null,null,null,null,null,null,null,null,null,null,"věcné břemeno - prosím uveďte"]
[]
[null,null,"ZASTAVENÁ NEMOVITOST"]
[null,null,null,null,"je totožná s objektem úvěru - níže uvedené údaje nevyplňujte a přejděte rovnou k podpisu žadatele a spolužadatele"]
[]
[null,null,null,null,"je odlišná od objektu úvěru"]
[null,null,"Vlastník nemovitosti",null,null,null,null,null,null,null,null,null,null,null,"žadatel nebo spolužadatel",null,null,null,null,null,null,null,null,null,null,"osoba blízká",null,null,null,null,null,"jiná osoba",null,null,null,null,"Jméno:"]
[]
[null,null,"Adresa nemovitosti"]
[]
[null,null,"Druh nemovitosti"]
[]
[null,null,null,"Byt - č. jednotky:"]
[]
[null,null,null,"Rodinný dům - č.p.:",null,null,null,null,null,null,null,null,null,null,null,null,null,null,null,null,null,null,null,null,null,"zděný",null,null,null,null,null,"montovaná dřevostavba"]
[]
[null,null,null,"Stavební pozemek - č.:"]
[]
[null,null,null,"Rekreační objekt - č.e./č.p.:",null,null,null,null,null,null,null,null,null,null,null,null,null,null,null,null,null,null,null,null,null,"chata",null,null,null,null,null,"chalupa"]
[]
[null,null,"Číslo listu vlastnictví",null,null,null,null,null,null,null,null,null,null,null,null,null,null,null,null,null,null,null,null,null,null,null,null,null,null,"Výše investice do nemovitosti"]
[]
[null,null,"Účel využití objektu úvěru",null,null,null,null,null,null,null,null,null,null,null,"vlastní bydlení (event. bydlení osoby blízké)",null,null,null,null,null,null,null,null,null,null,null,null,null,null,null,"rekreace",null,null,null,null,null,"pronájem"]
[]
[null,null,"Na nemovitosti vázne",null,null,null,null,null,null,null,null,null,null,null,"zástavní právo - prosím uveďte"]
[]
[null,null,null,null,null,null,null,null,null,null,null,null,null,null,"věcné břemeno - prosím uveďte"]
[]
[]
[null,null,"PROHLÁŠENÍ ŽADATELE A SPOLUŽADATELE"]
[null,null,"Prohlašuji, že veškeré údaje uvedené v těchto doplňujících informacích k žádosti o hypoteční úvěr, resp. v dokumentech přiložených, jsou úplné a odpovídají skutečnosti a že jsem nezamlčel(a) žádnou relevantní skutečnost, která by mohla ovlivnit rozhodnutí banky při poskytnutí úvěru."]
[null,null,"Prohlašuji, že úkon učiněný žadatelem nebo spolužadatelem vůči UniCredit Bank Czech Republic and Slovakia, a.s. do uzavření smlouvy o úvěru je úkonem učiněným jménem všech, tj žadatele a všech spolužadatelů. UniCredit Bank Czech Republic and Slovakia, a.s.  není povinna zkoumat vzájemné nároky těchto žadatelů a nenese žádnou odpovědnost za případné neoprávněné zásahy žadatelů do svých vzájemných nároků."]
[null,null,"Dále prohlašuji, že jsem plně způsobilý(á)  k právním úkonům."]
[null,null,"Dále prohlašuji, že nejsem v prodlení vůči státu nebo jinému subjektu s úhradou daní či poplatků, úhradou pojistného na sociální zabezpečení, zdravotní pojištění, úhradou cla nebo jiných povinných plateb a zároveň prohlašuji, že nemám jiné závazky vůči fyzickým či právnickým osobám s výjimkou uvedených výše v těchto doplňujících informacích k žádosti o hypoteční úvěr."]
[]
[]
[]
[]
[null,null,null,null,null,null,null,null,null,null,null,null,null,null,null,null,null,null,null,null,null,null,null,null,null,null,null,null,"Podpis žadatele"]
[]
[]
[null,null,"Místo:",null,null,null,null,null,null,null,null,null,null,null,"Datum:"]
[]
[null,null,"Místo, datum",null,null,null,null,null,null,null,null,null,null,null,null,null,null,null,null,null,null,null,null,null,null,null,null,null,"Podpis spolužadatele"]
[null,null,"Vyplní Banka"]
[null,null,"Totožnost žadatele/spolužadatele ověřil (jméno, příjmení):",null,null,null,null,null,null,null,null,null,null,null,null,null,null,null,null,null,null,null,null,null,null,null,null,null,"Dle občanských průkazů č. "]
[null,null,{"$f":"IF(zTotoznostOveril=\"\",\"\",zTotoznostOveril)","v":""}]
[null,null,"Dne:",null,null,null,null,null,null,null,null,null,null,null,"Podpis:"]
[null,null,{"$f":"IF(zDne=\"\",\"\",zDne)","v":""}]
[]
[null,null,"1) V případě zjednodušeného procesu refinancování přejděte k podpisu žadatele a spolužadatele. Informace o nemovitostech nevyplňujte"]
[]
[null,null,"Vyplní Banka",null,null,null,null,null,null,null,null,null,null,null,null,null,null,null,null,null,null,null,null,null,null,null,null,"Datum převzetí KOMPLETNÍ dokumentace "]
[null,null,"Pracovník banky:",null,null,null,null,null,null,{"$f":"IF(zPracovnikBanky=\"\",\"\",zPracovnikBanky)","v":""}]
[null,null,"Pobočka (číslo):",null,null,null,null,null,null,{"$f":"IF(zPobocka=\"\",\"\",zPobocka)","v":""}]
[null,null,"NDG klientů:",null,null,null,null,null,null,{"$f":"IF(zNdg=\"\",\"\",zNdg)","v":""}]
[null,null,null,null,null,null,null,null,null,null,null,null,null,null,null,null,null,null,null,null,null,null,null,null,null,null,null,"razítko \"Doručeno dne\""]
[]
[null,"DOPLŇUJÍCÍ INFORMACE K ŽÁDOSTI O POSKYTNUTÍ HYPOTEČNÍHO ÚVĚRU"]
[null,null,"Vyplní klient"]
[null,null,"ŽADATEL",null,null,null,null,null,null,null,null,null,null,null,null,null,null,null,null,null,null,null,null,null,null,null,null,null,"SPOLUŽADATEL"]
[null,null,"Titul před jménem",null,null,null,null,null,null,null,null,null,null,"Titul za jménem",null,null,null,null,null,null,null,null,null,null,null,null,null,null,"Titul před jménem",null,null,null,null,null,null,null,null,null,null,"Titul za jménem"]
[]
[null,null,"Jméno",null,null,null,null,null,null,null,null,null,null,null,null,null,null,null,null,null,null,null,null,null,null,null,null,null,"Jméno"]
[null,null,{"$f":"IF(zadJmeno3=0,\"\",zadJmeno3)","v":""},null,null,null,null,null,null,null,null,null,null,null,null,null,null,null,null,null,null,null,null,null,null,null,null,null,{"$f":"IF(zadJmeno4=0,\"\",zadJmeno4)","v":""}]
[null,null,"Příjmení",null,null,null,null,null,null,null,null,null,null,null,null,null,null,null,null,null,null,null,null,null,null,null,null,null,"Příjmení"]
[null,null,{"$f":"IF(zadPrijmeni3=0,\"\",zadPrijmeni3)","v":""},null,null,null,null,null,null,null,null,null,null,null,null,null,null,null,null,null,null,null,null,null,null,null,null,null,{"$f":"IF(zadPrijmeni4=0,\"\",zadPrijmeni4)","v":""}]
[null,null,"Rodné číslo / u cizinců datum narození",null,null,null,null,null,null,null,null,null,null,null,null,null,null,null,null,null,null,null,null,null,null,null,null,null,"Rodné číslo / u cizinců datum narození"]
[null,null,{"$f":"IF(zadRC3=0,\"\",zadRC3)","v":""},null,null,null,null,null,null,null,null,null,null,null,null,null,null,null,null,null,null,null,null,null,null,null,null,null,{"$f":"IF(zadRC4=0,\"\",zadRC4)","v":""}]
[null,null,"Státní příslušnost",null,null,null,null,null,null,null,null,null,null,null,null,null,null,null,null,null,null,null,null,null,null,null,null,null,"Státní příslušnost"]
[]
[null,null,"Rodinný stav",null,null,null,null,null,null,null,null,null,null,null,null,"Vzdělání",null,null,null,null,null,null,null,null,null,null,null,null,"Rodinný stav",null,null,null,null,null,null,null,null,null,null,null,null,"Vzdělání"]
[null,null,null," Svobodný/svobodná",null,null,null,null,null,null,null,null,null,null,null,null,"VŠ",null,null,null,null,null,null,null,null,null,null,null,null," Svobodný/svobodná",null,null,null,null,null,null,null,null,null,null,null,null,"VŠ"]
[]
[null,null,null," Ženatý/vdaná",null,null,null,null,null,null,null,null,null,null,null,null,"Vyšší odborné",null,null,null,null,null,null,null,null,null,null,null,null," Ženatý/vdaná",null,null,null,null,null,null,null,null,null,null,null,null,"Vyšší odborné"]
[]
[null,null,null,null,"SJM zúženo",null,null,null,null,null,null,null,null,null,null,null,"SŠ s maturitou",null,null,null,null,null,null,null,null,null,null,null,null,null,"SJM zúženo",null,null,null,null,null,null,null,null,null,null,null,"SŠ s maturitou"]
[]
[null,null,null,null,"oddělená jmění",null,null,null,null,null,null,null,null,null,null,null,"OU s maturitou",null,null,null,null,null,null,null,null,null,null,null,null,null,"oddělená jmění",null,null,null,null,null,null,null,null,null,null,null,"OU s maturitou"]
[]
[null,null,null," Rozvedený/rozvedená",null,null,null,null,null,null,null,null,null,null,null,null,"OU",null,null,null,null,null,null,null,null,null,null,null,null," Rozvedený/rozvedená",null,null,null,null,null,null,null,null,null,null,null,null,"OU"]
[]
[null,null,null,null,"méně než 3 let",null,null,null,null,null,null,null,null,null,null,null,"Základní",null,null,null,null,null,null,null,null,null,null,null,null,null,"méně než 3 let",null,null,null,null,null,null,null,null,null,null,null,"Základní"]
[]
[null,null,null,null,"více než 3 let",null,null,null,null,null,null,null,null,null,null,null,null,null,null,null,null,null,null,null,null,null,null,null,null,null,"více než 3 let"]
[]
[null,null,null," Vdovec/vdova",null,null,null,null,null,null,null,null,null,null,null,null,null,null,null,null,null,null,null,null,null,null,null,null,null," Vdovec/vdova"]
[]
[null,null,null," Registrovaný partner",null,null,null,null,null,null,null,null,null,null,null,null,null,null,null,null,null,null,null,null,null,null,null,null,null," Registrovaný partner"]
[null,null,"Zvláštní vztah k UniCredit Bank Czech Republic and Slovakia, a.s. podle zákona o bankách 1)",null,null,null,null,null,null,null,null,null,null,null,null,null,null,null,null,null,null,null,null,null,null,null,null,null,"Zvláštní vztah k UniCredit Bank Czech Republic and Slovakia, a.s. podle zákona o bankách 1)"]
[null,null,null,"Ano",null,null,"Ne",null,null,null,null,null,null,null,null,null,null,null,null,null,null,null,null,null,null,null,null,null,null,"Ano",null,null,"Ne"]
[]
[null,null,null,null,null,null,null,null,null,null,null,"Jaký je vztah žadatele a spolužadatele?"]
[null,null,"Bytové poměry",null,null,null,null,null,null,null,null,null,null,null,null,null,null,null,null,null,null,null,null,null,null,null,null,null,"Bytové poměry"]
[null,null,null,"Vlastnictví domu/bytu",null,null,null,null,null,null,null,null,null,"Nájem",null,null,null,null,null,"Bydlení s rodiči",null,null,null,null,null,null,null,null,null,"Vlastnictví domu/bytu",null,null,null,null,null,null,null,null,null,"Nájem",null,null,null,null,null,"Bydlení s rodiči"]
[]
[null,null,null,"Právo k užívání družstevního domu/bytu",null,null,null,null,null,null,null,null,null,null,null,null,null,null,null,"Jiné",null,null,null,null,null,null,null,null,null,"Právo k užívání družstevního domu/bytu",null,null,null,null,null,null,null,null,null,null,null,null,null,null,null,"Jiné"]
[null,null,"Bydliště (adresa skutečného pobytu, je-li odlišná od trvalého pobytu)",null,null,null,null,null,null,null,null,null,null,null,null,null,null,null,null,null,null,null,null,null,null,null,null,null,"Bydliště (adresa skutečného pobytu, je-li odlišná od trvalého pobytu)"]
[]
[null,null,"Délka skutečného pobytu (v letech)",null,null,null,null,null,null,null,null,null,null,null,null,"Korespondenční adresa",null,null,null,null,null,null,null,null,null,null,null,null,"Délka skutečného pobytu (v letech)",null,null,null,null,null,null,null,null,null,null,null,null,"Korespondenční adresa"]
[null,null,null,null,null,null,null,null,null,null,null,null,null,null,null,null,"Adresa trvalého pobytu",null,null,null,null,"Adresa bydliště",null,null,null,null,null,null,null,null,null,null,null,null,null,null,null,null,null,null,null,null,"Adresa trvalého pobytu",null,null,null,null,"Adresa bydliště"]
[]
[null,null,"Cizí státní příslušník ",null,null,null,null,null,null,null,null,null,null,null,null,null,null,null,null,null,null,null,null,null,null,null,null,null,"Cizí státní příslušník "]
[null,null,null,"Délka pobytu v ČR (v letech)",null,null,null,null,null,null,null,null,null,null,null,"Pobyt v ČR",null,null,null,null,null,null,null,null,null,null,null,null,null,"Délka pobytu v ČR (v letech)",null,null,null,null,null,null,null,null,null,null,null,"Pobyt v ČR"]
[null,null,null,null,null,null,null,null,null,null,null,null,null,null,null,null,"Trvalý",null,null,null,null,"Přechodný",null,null,null,null,null,null,null,null,null,null,null,null,null,null,null,null,null,null,null,null,"Trvalý",null,null,null,null,"Přechodný"]
[]
[]
[null,null,"Zaměstnavatel",null,null,null,null,null,null,null,null,null,null,null,null,null,null,null,null,null,null,null,null,null,null,null,null,null,"Zaměstnavatel"]
[null,null,"IČ",null,null,null,null,null,null,null,null,null,null,null,null,null,null,null,null,null,null,null,null,null,null,null,null,null,"IČ"]
[null,null,"Pracovní pozice",null,null,null,null,null,null,null,null,null,null,null,null,null,null,null,null,null,null,null,null,null,null,null,null,null,"Pracovní pozice"]
[]
[null,null,"Hlavní zdroj příjmu 2)",null,null,null,null,null,null,null,null,null,null,null,null,null,null,null,null,null,null,null,null,null,null,null,null,null,"Hlavní zdroj příjmu"]
[null,null,null,null,"závislá činnost",null,null,null,null,null,null,null,null,null,null,null,null,"v ČR",null,null,"v zahraničí",null,null,null,null,null,null,null,null,null,"závislá činnost",null,null,null,null,null,null,null,null,null,null,null,null,"v ČR",null,null,"v zahraničí"]
[]
[null,null,null,null,null,null,null,null,null,null,null,null,null,null,null,null,null,null,null,null,null,null,null,null,"Kč",null,null,null,null,null,null,null,null,null,null,null,null,null,null,null,null,null,null,null,null,null,null,null,null,null,"Kč"]
[null,null,null,null,null,"délka současného prac. poměru",null,null,null,null,null,null,null,null,null,null,null,null,null,null,null,"v letech",null,null,null,null,null,null,null,null,null,"délka současného prac. poměru",null,null,null,null,null,null,null,null,null,null,null,null,null,null,null,"v letech"]
[null,null,null,null,null,"délka předchozího prac. poměru",null,null,null,null,null,null,null,null,null,null,null,null,null,null,null,"v letech",null,null,null,null,null,null,null,null,null,"délka předchozího prac. poměru",null,null,null,null,null,null,null,null,null,null,null,null,null,null,null,"v letech"]
[]
[null,null,null,null,null,"zkušební / výpovědní doba 3)",null,null,null,null,null,null,null,null,null,null,null,"Ano",null,null,"Ne",null,null,null,null,null,null,null,null,null,null,"zkušební / výpovědní doba 3)",null,null,null,null,null,null,null,null,null,null,null,"Ano",null,null,"Ne"]
[]
[null,null,null,null,"samostatně výdělečná činnost",null,null,null,null,null,null,null,null,null,null,null,null,null,null,null,null,null,null,null,"Kč",null,null,null,null,null,"samostatně výdělečná činnost",null,null,null,null,null,null,null,null,null,null,null,null,null,null,null,null,null,null,null,"Kč"]
[]
[null,null,null,null,null,"aktivní nepřetržitě min. 12 měsíců",null,null,null,null,null,null,null,null,null,null,null,"Ano",null,null,"Ne",null,null,null,null,null,null,null,null,null,null,"aktivní nepřetržitě min. 12 měsíců",null,null,null,null,null,null,null,null,null,null,null,"Ano",null,null,"Ne"]
[]
[null,null,null,null,"příjem z pronájmu",null,null,null,null,null,null,null,null,null,null,null,null,null,null,null,null,null,null,null,"Kč",null,null,null,null,null,"příjem z pronájmu",null,null,null,null,null,null,null,null,null,null,null,null,null,null,null,null,null,null,null,"Kč"]
[]
[null,null,null,null,"příjem z kapitálového majetku",null,null,null,null,null,null,null,null,null,null,null,null,null,null,null,null,null,null,null,"Kč",null,null,null,null,null,"příjem z kapitálového majetku",null,null,null,null,null,null,null,null,null,null,null,null,null,null,null,null,null,null,null,"Kč"]
[]
[null,null,null,null,"starobní důchod",null,null,null,null,null,null,null,null,null,null,null,null,null,null,null,null,null,null,null,"Kč",null,null,null,null,null,"starobní důchod",null,null,null,null,null,null,null,null,null,null,null,null,null,null,null,null,null,null,null,"Kč"]
[]
[null,null,null,null,"jiný",null,null,null,null,null,null,null,null,null,null,null,null,null,null,null,null,null,null,null,"Kč",null,null,null,null,null,"jiný",null,null,null,null,null,null,null,null,null,null,null,null,null,null,null,null,null,null,null,"Kč"]
[]
[null,null,"Počet dospělých  v domácnosti",null,null,null,null,null,null,null,null,null,null,null,"Počet dětí v domácnosti (do 26 let)",null,null,null,null,null,null,null,null,null,null,null,null,null,"Počet dospělých  v domácnosti",null,null,null,null,null,null,null,null,null,null,null,"Počet dětí v domácnosti (do 26 let)"]
[]
[]
[null,null,null,null,null,null,null,null,null,null,null,null,null,null,"jako spolu/žadatel",null,null,null,null,null,null,"jako ručitel",null,null,null,null,null,null,null,null,null,null,null,null,null,null,null,null,null,null,"jako spolu/žadatel",null,null,null,null,null,null,"jako ručitel"]
[null,null,"Hypoteční úvěr, úvěr ze stavebního spoření",null,null,null,null,null,null,null,null,null,null,null,null,null,null,null,null,null,null,null,null,null,null,null,null,null,"Hypoteční úvěr, úvěr ze stavebního spoření"]
[null,null,"Osobní úvěr, leasing, splátkový prodej, zápůjčka",null,null,null,null,null,null,null,null,null,null,null,null,null,null,null,null,null,null,null,null,null,null,null,null,null,"Osobní úvěr, leasing, splátkový prodej, zápůjčka"]
[null,null,"Kontokorentní úvěr (vč. nevyužívaných)",null,null,null,null,null,null,null,null,null,null,null,null,null,null,null,null,null,null,null,null,null,null,null,null,null,"Kontokorentní úvěr (vč. nevyužívaných)"]
[null,null,"Kreditní karta (vč. nevyužívaných)",null,null,null,null,null,null,null,null,null,null,null,null,null,null,null,null,null,null,null,null,null,null,null,null,null,"Kreditní karta (vč. nevyužívaných)"]
[null,null,"Další pravidelné výdaje (výživné, spoření, pojištění)",null,null,null,null,null,null,null,null,null,null,null,null,null,null,null,null,null,null,null,null,null,null,null,null,null,"Další pravidelné výdaje (výživné, spoření, pojištění)"]
[null,null,"Náklady na bydlení",null,null,null,null,null,null,null,null,null,null,null,null,null,null,null,null,null,null,null,null,null,null,null,null,null,"Náklady na bydlení"]
[]
[null,null,"SPECIFIKACE ÚVĚRU"]
[null,null,"Typ úrokové sazby",null,null,null,null,null,null,null,null,null,null,null,null,null,null,null,null,null,null,null,null,"Délka čerpání úvěru (v měsících) 6)",null,null,null,null,null,null,null,null,null,null,null,null,null,"Mám zájem o slevu na úrokové sazbě za:"]
[null,null,{"$f":"IF(LEFT(Fix_obdobi,5) <> \"Float\",\"X\",\"\")","v":"X"},"Fixní - délka fixace úrokové sazby (v letech) 4)",null,null,null,null,null,null,null,null,null,null,null,null,null,{"$f":"IF(LEFT(Fix_obdobi,2) <> \"Fl\",LEFT(Fix_obdobi,2),\"\")","v":"3 "},null,null,null,null,null,{"$f":"DatumDocerpani","v":0},null,null,null,null,null,null,null,null,null,null,null,null,null,{"$f":"IF(SlevaCardif = \"Ano\",\"X\",\"\")","v":"X"},"Pojištění schopnosti splácet 7)"]
[]
[null,null,{"$f":"IF(LEFT(Fix_obdobi,10) = \"Float\",\"X\",\"\")","v":""},"Variabilní (Převratná hypotéka) 5)",null,null,null,null,null,null,null,null,null,null,null,null,null,null,null,null,null,null,null,null,null,null,null,null,null,null,null,null,null,null,null,null,null,{"$f":"IF(SlevaUcet = \"Ano\",\"X\",\"\")","v":"X"},"Aktivní běžný účet 8)"]
[]
[null,null,null,null,null,null,null,null,null,null,null,null,null,null,null,null,null,null,null,null,null,null,null,null,null,null,null,null,null,null,null,null,null,null,null,null,null,{"$f":"IF(SlevaKarta = \"Ano\",\"X\",\"\")","v":"X"},"Aktivní kreditní kartu 9)"]
[null,null,"Účel úvěru"]
[null,null,"x","Koupě ",null,null,null,null,null,null,null,null,null,null,null,null,null,null,null,null,null,null,null,null,null,null,null,null,null,"Typ úvěru"]
[]
[null,null,{"$f":"IF(HlavUcelUveru=\"Refinancování úvěru – zjednodušené\",\"X\",IF(HlavUcelUveru=\"Refinancování úvěru – standard\",\"X\",\"\"))","v":""},"Refinancování ",null,null,null,null,null,null,null,null,null,null,null,null,null,null,null,null,null,null,null,null,null,null,null,null,null,{"$f":"IF(TypHypoteky=\"Hypoteční úvěr účelový rezidenční Individual\",\"X\",\"\")","v":"X"},"INDIVIDUAL - Hypoteční úvěr účelový"]
[]
[null,null,{"$f":"IF(HlavUcelUveru=\"Výstavba\",\"X\",IF(HlavUcelUveru=\"Rekonstrukce\",\"X\",\"\"))","v":""},"Výstavba / Rekonstrukce",null,null,null,null,null,null,null,null,null,null,null,null,null,null,null,null,null,null,null,null,null,null,null,null,null,{"$f":"IF(TypHypoteky=\"Hypoteční úvěr účelový rezidenční Flexi\",\"X\",\"\")","v":""},"FLEXI - Hypoteční úvěr s možností předčasné splátky "]
[]
[null,null,{"$f":"IF(HlavUcelUveru=\"Vypořádání majetkových nároků\",\"X\",\"\")","v":""},"Vypořádání majetkových poměrů spojených s nemovitostí",null,null,null,null,null,null,null,null,null,null,null,null,null,null,null,null,null,null,null,null,null,null,null,null,null,{"$f":"IF(TypHypoteky=\"Hypoteční úvěr účelový rezidenční Twin\",\"X\",\"\")","v":""},"TWIN - Hypoteční úvěr s kombinací neúčelové části "]
[]
[null,null,{"$f":"IF(HlavUcelUveru=\"Zpětné proplacení vl. zdrojů\",\"X\",\"\")","v":""},"Zpětné proplacení finančních prostředků",null,null,null,null,null,null,null,null,null,null,null,null,null,null,null,null,null,null,null,null,null,null,null,null,null,{"$f":"IF(TypHypoteky=\"Hypoteční úvěr účelový nerezidenční\",\"X\",\"\")","v":""},"Hypoteční úvěr účelový nerezidenční"]
[]
[null,null,null,"Jiný ",null,null,{"$f":"IF(dopUcelUveru6_3=\"\",\"\",HlavUcelUveru)","v":""},null,null,null,null,null,null,null,null,null,null,null,null,null,null,null,null,null,null,null,null,null,null,{"$f":"IF(TypHypoteky=\"Hypoteční úvěr neúčelový\",\"X\",\"\")","v":""},"Hypoteční úvěr neúčelový"]
[]
[null,null,null,"Další účel"]
[]
[null,null,"1) Za osoby, které mají k bance zvláštní vztah, se podle § 19 zákona č. 21/1992 Sb., o bankách, považují a) členové statutárního orgánu a vedoucí zaměstnanci banky, b) členové dozorčí rady banky, c) právnické osoby mající kontrolu nad bankou, jejich hlavní akcionáři a členové vedení těchto společností, d) osoby blízké členům statutárního orgánu, dozorčí rady, vedoucím zaměstnancům banky a osobám majícím kontrolu nad bankou, e) právnické osoby, ve kterých některá z osob uvedených pod písmeny a), b) a c) má podíl na základním jmění přesahující 10 %, f) hlavní akcionáři banky a jakákoliv právnická osoba pod jejich kontrolou, g) členové bankovní rady České národní banky, h) právnické osoby, nad kterými má banka kontrolu."]
[null,null,"2) Výše čistého měsíčního příjmu za poslední 3 měsíce. U osoby samostatně výdělečně činné za posledních 12 kalendářních měsíců."]
[null,null,"3) Nehodící se škrtněte."]
[null,null,"4) Déka fixace úrokové sazby je počet let, po které bude fixní úroková sazba neměnná."]
[null,null,"5) Úroková sazba je složena z variabilní a fixní složky, tj. její celková výše se mění v závislosti na situaci na finančním trhu."]
[null,null,"6) Období čerpání (od podpisu smlouvy do ukončení čerpání)."]
[null,null,"7) Úvěrové životní pojištění s jednorázově splatným pojistným, délka pojištění je 5 let, pojištění pro případ úmrtí + pracovní neschopnosti / ztráty zaměstnání / invalidity III. stupně. "]
[null,null,"8) Platí i pro stávajícího klienta UniCredit Bank v případě, že již službu využívá."]
[null,null,"9) Rámec kreditní karty je schválen současně s úvěrem. Karta je poskytnuta za zvýhodněných podmínek. Sleva platí i pro již existující kreditní kartu."]
[null,null,"10) Podmínky objednání odhadu Vám budou sděleny pracovníkem Banky, resp. pověřeným zástupcem Banky."]
[]
[null,null,"FINANCOVANÁ NEMOVITOST 1)"]
[null,null,"Adresa nemovitosti"]
[]
[null,null,"Druh nemovitosti"]
[]
[null,null,null,"Byt - č. jednotky:"]
[]
[null,null,null,"Rodinný dům - č.p.:",null,null,null,null,null,null,null,null,null,null,null,null,null,null,null,null,null,null,null,null,null,"zděný",null,null,null,null,null,"montovaná dřevostavba"]
[]
[null,null,null,"Stavební pozemek - č.:"]
[]
[null,null,null,"Rekreační objekt - č.e./č.p.:",null,null,null,null,null,null,null,null,null,null,null,null,null,null,null,null,null,null,null,null,null,"chata",null,null,null,null,null,"chalupa"]
[]
[null,null,"Číslo listu vlastnictví",null,null,null,null,null,null,null,null,null,null,null,null,null,null,null,null,null,null,null,null,null,null,null,null,null,null,"Výše investice do nemovitosti"]
[]
[null,null,"Účel využití objektu úvěru",null,null,null,null,null,null,null,null,null,null,null,"vlastní bydlení (event. bydlení osoby blízké)",null,null,null,null,null,null,null,null,null,null,null,null,null,null,null,"rekreace",null,null,null,null,null,"pronájem"]
[]
[null,null,"Na nemovitosti vázne",null,null,null,null,null,null,null,null,null,null,null,"zástavní právo - prosím uveďte"]
[]
[null,null,null,null,null,null,null,null,null,null,null,null,null,null,"věcné břemeno - prosím uveďte"]
[]
[null,null,"ZASTAVENÁ NEMOVITOST"]
[null,null,null,null,"je totožná s objektem úvěru - níže uvedené údaje nevyplňujte a přejděte rovnou k podpisu žadatele a spolužadatele"]
[]
[null,null,null,null,"je odlišná od objektu úvěru"]
[null,null,"Vlastník nemovitosti",null,null,null,null,null,null,null,null,null,null,null,"žadatel nebo spolužadatel",null,null,null,null,null,null,null,null,null,null,"osoba blízká",null,null,null,null,null,"jiná osoba",null,null,null,null,"Jméno:"]
[]
[null,null,"Adresa nemovitosti"]
[]
[null,null,"Druh nemovitosti"]
[]
[null,null,null,"Byt - č. jednotky:"]
[]
[null,null,null,"Rodinný dům - č.p.:",null,null,null,null,null,null,null,null,null,null,null,null,null,null,null,null,null,null,null,null,null,"zděný",null,null,null,null,null,"montovaná dřevostavba"]
[]
[null,null,null,"Stavební pozemek - č.:"]
[]
[null,null,null,"Rekreační objekt - č.e./č.p.:",null,null,null,null,null,null,null,null,null,null,null,null,null,null,null,null,null,null,null,null,null,"chata",null,null,null,null,null,"chalupa"]
[]
[null,null,"Číslo listu vlastnictví",null,null,null,null,null,null,null,null,null,null,null,null,null,null,null,null,null,null,null,null,null,null,null,null,null,null,"Výše investice do nemovitosti"]
[]
[null,null,"Účel využití objektu úvěru",null,null,null,null,null,null,null,null,null,null,null,"vlastní bydlení (event. bydlení osoby blízké)",null,null,null,null,null,null,null,null,null,null,null,null,null,null,null,"rekreace",null,null,null,null,null,"pronájem"]
[]
[null,null,"Na nemovitosti vázne",null,null,null,null,null,null,null,null,null,null,null,"zástavní právo - prosím uveďte"]
[]
[null,null,null,null,null,null,null,null,null,null,null,null,null,null,"věcné břemeno - prosím uveďte"]
[]
[null,null,"PROHLÁŠENÍ ŽADATELE A SPOLUŽADATELE"]
[null,null,"Prohlašuji, že veškeré údaje uvedené v těchto doplňujících informacích k žádosti o hypoteční úvěr, resp. v dokumentech přiložených, jsou úplné a odpovídají skutečnosti a že jsem nezamlčel(a) žádnou relevantní skutečnost, která by mohla ovlivnit rozhodnutí banky při poskytnutí úvěru."]
[null,null,"Prohlašuji, že úkon učiněný žadatelem nebo spolužadatelem vůči UniCredit Bank Czech Republic and Slovakia, a.s. do uzavření smlouvy o úvěru je úkonem učiněným jménem všech, tj žadatele a všech spolužadatelů. UniCredit Bank Czech Republic and Slovakia, a.s.  není povinna zkoumat vzájemné nároky těchto žadatelů a nenese žádnou odpovědnost za případné neoprávněné zásahy žadatelů do svých vzájemných nároků."]
[null,null,"Dále prohlašuji, že jsem plně způsobilý(á)  k právním úkonům."]
[null,null,"Dále prohlašuji, že nejsem v prodlení vůči státu nebo jinému subjektu s úhradou daní či poplatků, úhradou pojistného na sociální zabezpečení, zdravotní pojištění, úhradou cla nebo jiných povinných plateb a zároveň prohlašuji, že nemám jiné závazky vůči fyzickým či právnickým osobám s výjimkou uvedených výše v těchto doplňujících informacích k žádosti o hypoteční úvěr."]
[]
[]
[]
[]
[null,null,null,null,null,null,null,null,null,null,null,null,null,null,null,null,null,null,null,null,null,null,null,null,null,null,null,null,"Podpis žadatele"]
[]
[]
[]
[]
[null,null,"Místo, datum",null,null,null,null,null,null,null,null,null,null,null,null,null,null,null,null,null,null,null,null,null,null,null,null,null,"Podpis spolužadatele"]
[null,null,"Vyplní Banka"]
[null,null,"Totožnost žadatele/spolužadatele ověřil (jméno, příjmení):",null,null,null,null,null,null,null,null,null,null,null,null,null,null,null,null,null,null,null,null,null,null,null,null,null,"Dle občanských průkazů č. "]
[null,null,{"$f":"IF(zTotoznostOveril=\"\",\"\",zTotoznostOveril)","v":""}]
[null,null,"Dne:",null,null,null,null,null,null,null,null,null,null,null,"Podpis:"]
[null,null,{"$f":"IF(zDne=\"\",\"\",zDne)","v":""}]
[]
[null,null,"1) V případě zjednodušeného procesu refinancování přejděte k podpisu žadatele a spolužadatele. Informace o nemovitostech nevyplňujte"]
[]
[null,"PŘÍLOHA K ŽÁDOSTI O POSKYTNUTÍ HYPOTEČNÍHO ÚVĚRU"]
[]
[]
[null,"VYHODNOCENÍ RIZIK SPOJENÝCH SE ZÁSTAVOU NEMOVITOSTI"]
[]
[]
[null,"Žadatel žádá o posouzení vhodnosti nemovitosti označené v žádosti jako zastavená nemovitost pro zřízení zástavního práva a zavazuje se uhradit cenu za vyhodnocení rizik spojených se zástavou nemovitosti dle sazebníku uvedeného níže."]
[null,"Žadatel bere na vědomí a souhlasí s tím, že k realizaci posouzení vhodnosti nemovitosti ze strany banky dojde  po předložení dokladu o zaplacení příslušné ceny, případně ověření úhrady této ceny. "]
[null,"Žadatel je za účelem realizace tohoto posouzení povinen zabezpečit přístup do předmětné nemovitosti a poskytnout součinnost při zajišťování potřebných listinných podkladů, jako je např. projektová dokumentace k nemovitosti, stavební povolení, kolaudační souhlas, nabývací titul, nájemní smlouvy apod."]
[null,"Žadatel je povinen uhradit cenu za vyhodnocení rizik spojených se zástavou nemovitosti na účet č. 2109626508/2700, přičemž jako variabilní symbol uvede své rodné číslo bez lomítka (občan bez rodného čísla uvede jako variabilní symbol datum svého narození ve formátu RRRRMMDD a do poznámky své jméno)."]
[]
[]
[]
[null,null,null,null,"SAZEBNÍK"]
[null,null,null,null,null,null,null,null,"Bytová jednotka v krajském městě (účel refinancování)",null,null,null,null,null,null,null,null,null,null,null,null,null,null,null,null,null,null,null,null,null,null,null,null,null,null,null,null,"zdarma"]
[null,null,null,null,null,null,null,null,"expresní vyhodnocení "]
[null,null,null,null,null,null,null,null,"Bytová jednotka",null,null,null,null,null,null,null,null,null,null,null,null,null,null,null,null,null,null,null,null,null,null,null,null,null,null,null,null,3700]
[null,null,null,null,null,null,null,null,"Pozemek"]
[null,null,null,null,null,null,null,null,"Rodinný dům",null,null,null,null,null,null,null,null,null,null,null,null,null,null,null,null,null,null,null,null,null,null,null,null,null,null,null,null,4900]
[null,null,null,null,null,null,null,null,"Objekt individuální rekreace   "]
[null,null,null,null,null,null,null,null,"Ostatní objekty"]
[]
[]
[]
[]
[]
[null,null,null,null,null,null,null,"Typy nemovitostí vhodné k zástavě:"]
[null,null,null,null,null,null,null,"Bytová jednotka",null,null,null,null,null,null,null,"Rodinný dům",null,null,null,null,null,null,null,"Objekt individuální rekreace chata/chalupa ",null,null,null,null,null,null,"Bytový dům",null,null,null,null,null,null,null,"Pozemek"]
[]
[]
[]
[]
[]
[]
[]
[]
[]
[null,null,null,null,null,null,null,null,null,null,null,null,null,null,null,null,null,null,null,null,null,null,null,null,null,null,null,null,"Podpis žadatele"]
[]
[null,"Poučení o zpracování osobních údajů\npodle § 11 zákona č. 101/2000 Sb., o ochraně osobních údajů („ZOOÚ“)"]
[]
[null,"Rozsah a účel zpracování osobních údajů"]
[null,"UniCredit Bank Czech Republic and Slovakia, a.s. (dále jen „Banka“) zpracovává osobní údaje klientů v rozsahu, v jakém jí jsou klienty poskytnuty v souvislosti s poskytováním jednotlivých bankovních produktů, za účelem jednání s klientem o smlouvě a pro poskytování bankovních služeb dle bankovní licence. Banka, pokud s tím klienti nevysloví písemný nesouhlas, zpracovává v zákonem daném rozsahu osobní údaje klientů rovněž i k nabízení obchodu nebo služeb klientům. Osobní údaje klientů týkající se jejich bonity a důvěryhodnosti Banka zpracovává v rozsahu, v jakém je v souladu se zákonem nebo s příslušným souhlasem klienta obdrží od klienta, z mezibankovních nebo jiných úvěrových registrů a dalších zdrojů."]
[]
[null,"Doba zpracování osobních údajů"]
[null,"Banka je podle § 16 zákona č. 253/2008 Sb., o některých opatřeních proti legalizaci výnosů z trestné činnosti a financování terorismu a ustanovení § 21 odst. 2 zákona č. 21/1992 Sb., o bankách, ve znění pozdějších předpisů (ZoB), povinna uchovávat osobní údaje a údaje a doklady o obchodech po dobu 10 let od uskutečnění obchodu nebo ukončení obchodního vztahu s klientem."]
[]
[null,"Způsob zpracování osobních údajů"]
[null,"Banka osobní údaje klientů zpracovává automatizovaně i manuálně při dodržení všech bezpečnostních zásad pro správu a zpracování osobních údajů a to buď sama anebo prostřednictvím zpracovatelů, s nimiž má uzavřenu smlouvu o zpracování osobních údajů v souladu s § 6 ZOOÚ. Veškerá místa, na kterých dochází ke zpracování osobních údajů Bankou nebo zpracovateli Banky, jsou nahlášena jako místa zpracování osobních údajů u Úřadu pro ochranu osobních údajů. Osobní údaje bez výslovného souhlasu klienta nebudou předávány do států, které mají horší pravidla pro nakládání s osobními údaji než Česká republika."]
[]
[null,"Dobrovolnost poskytnutí osobních údajů, následek odmítnutí "]
[null,"Poskytnutí osobních údajů klienta je dobrovolné. V rozsahu, v jakém je však Banka na základě zákona povinna osobní údaje klientů zjišťovat, zpracovávat a uchovávat, je však poskytnutí některých osobních údajů podmínkou pro poskytování služeb ze strany Banky. Těmito povinnými údaji jsou: všechna jména a příjmení, rodné číslo (nebylo-li přiděleno pak datum narození), místo narození, pohlaví, trvalý nebo jiný pobyt a státní občanství; jde-li o podnikající fyzickou osobu, též její obchodní firma, odlišující dodatek nebo další označení, sídlo a identifikační číslo, druh a číslo průkazu totožnosti, stát, popřípadě orgán, který jej vydal, a dobu jeho platnosti. "]
[null,"Poskytnutí zbývajících osobních údajů je závislé pouze na vůli klienta a Banka předáním těchto údajů nepodmiňuje poskytování bankovních služeb. Tím, že klient umožní ostatní osobní údaje zaznamenat do smlouvy, kterou s Bankou uzavře, bude takové jednání považováno za výslovné udělení souhlasu se zpracováním těchto osobních údajů Bankou a to po celou dobu trvání smluvních vztahů."]
[]
[null,"Komu mohou být osobní údaje zpřístupněny"]
[null,"Osobní údaje klientů mohou být zpřístupněny zaměstnancům Banky, osobám podílejícím se na vedení a řízení Banky, akcionářům Banky, osobám spolupracujícím s Bankou na plnění jejích povinností (včetně realizace práv a povinností vyplývajících ze smluv uzavřených s klientem), osobám oprávněným na základě jiných právních předpisů (např. orgánům dozoru, včetně orgánů dozoru v zemích sídel osob začleněných do koncernu UniCredit Group), osobám začleněným do koncernu UniCredit Group a osobám vedoucím mezibankovní informační systémy v zemích sídla akcionářů Banky a jiným zpracovatelům osobních údajů, popř. jejich zaměstnancům a to především pro účely plnění smlouvy s klientem, případně také pro zajištění ochrany rizik Banky a koncernu UniCredit Group, výkaznictví, auditu a vnitřní kontroly. "]
[null,"Tyto údaje mohou být zpřístupněny i dalším osobám v návaznosti na zvláštní souhlas klienta. Některé osobní údaje klientů (informace o bankovním spojení, identifikačních údajích majitelů účtů a záležitostech, které vypovídají o bonitě a důvěryhodnosti klientů) mohou být rovněž zpřístupněny dalším bankám nebo pobočkám zahraničních bank v rámci plnění povinnosti postupovat při výkonu své činnosti obezřetně, a to i prostřednictvím právnické osoby, která není bankou (§ 38a odst. 1 ZoB). "]
[]
[null,"Přístup subjektu údajů k informacím"]
[null,"Banka je povinna klienta na jeho žádost písemně informovat o tom, v jakém rozsahu a pro jaký účel jsou jeho osobní údaje zpracovávány, kdo a jakým způsobem bude osobní údaje zpracovávat a komu mohou být osobní údaje zpřístupněny. Přesný rozsah informace definuje § 12 odst. 2 ZOOÚ. Banka má právo za poskytnutí informace požadovat přiměřenou úhradu nepřevyšující náklady nezbytné na poskytnutí informace. "]
[]
[null,"Ochrana práv subjektu údajů"]
[null,"Klient, který se domnívá, že Banka nebo jí pověřený konkrétní zpracovatel provádí zpracování jeho osobních údajů, které je v rozporu s ochranou klienta nebo v rozporu se zákonem, zejména jsou-li osobní údaje nepřesné s ohledem na účel jejich zpracování, může požádat Banku nebo konkrétního zpracovatele o vysvětlení a požadovat, aby Banka nebo konkrétní zpracovatel odstranili takto vzniklý stav. Zejména se může jednat o blokování, provedení opravy, doplnění nebo likvidaci osobních údajů. Je-li žádost klienta oprávněná, Banka nebo konkrétní zpracovatel neprodleně závadný stav odstraní. Klient má rovněž právo obrátit se přímo na Úřad pro ochranu osobních údajů. Pokud vznikla v důsledku zpracování osobních údajů klienta jiná než majetková újma, postupuje se při uplatňování jejího nároku podle občanského zákoníku."]
[]
[null,"Prohlášení k variabilní sazbě"]
[]
[]
[null,"Variabilní úroková sazba se skládá ze dvou složek: proměnné (variabilní) složky a pevné složky sazby."]
[]
[null,"Pevná složka úrokové sazby je sjednána ve smlouvě o úvěru pro dobu 5 let od 1.čerpání úvěru."]
[]
[null,"Variabilní složka úrokové sazby je závislá na vývoji referenční úrokové sazby 1M PRIBOR, tj. UniCredit Bank ji nemůže ovlivnit. Mění se v závislosti na vývoji sazeb na mezibankovním trhu."]
[]
[null,"Měsíční anuitní splátka se mění v závislosti na výši úrokové sazby (ovlivněné její variabilní složkou) a UniCredit Bank  při změně v předstihu oznamuje její novou výši."]
[]
[null,"Klient je povinen udržovat na účtu určeném ke splácení úvěru dostatečný objem prostředků ke splácení úvěru."]
[]
[null,"Změna úrokové sazby může ovlivnit schopnost klienta splácet úvěr."]
[null,"Dojde-li v období 12 kalendářních měsíců ke zvýšení úrokové sazby nejméně na dvojnásobek oproti sazbě na počátku tohoto období, je Banka oprávněna variabilní úrokovou sazbu změnit na úrokovou sazbu fixní, kterou bude v dané době s klienty sjednávat u úvěrů tohoto druhu na období jednoho roku. Přitom je povinna Klienta o této změně informovat, a to nejpozději  30 dnů před jejím provedením."]
[]
[null,"Klient může o přechod na fixní úrokovou sazbu požádat kdykoliv bez ohledu na vývoj úrokových sazeb s tím, že tato změna je možná pouze s účinností od 25. dne v kalendářním měsíci."]
[]
[null,"Prohlašuji, že jsem se seznámil s mechanismem změny variabilní úrokové sazby a jejími dopady. "]
[]
[]
[]
[]
[]
[null,null,null,null,null,null,null,null,null,null,null,null,null,null,null,null,null,null,null,null,null,null,null,null,null,null,null,"Podpis žadatele"]
[]
[]
[]
[]
[null,"Místo, datum",null,null,null,null,null,null,null,null,null,null,null,null,null,null,null,null,null,null,null,null,null,null,null,null,null,"Podpis spolužadatele"]
[]
[null,"PŘIHLÁŠKA DO POJIŠTĚNÍ\nSKUPINOVÉ POJIŠTĚNÍ SCHOPNOSTI SPLÁCET HYPOTEČNÍ ÚVĚR S JEDNORÁZOVÝM POJISTNÝM"]
[]
[null,"ZÁJEMCE O POJIŠTĚNÍ:",null,null,null,null,null,null,null,null,{"$f":"IF(zPojistenyHlavni=\"X\",\"X\",\"\")","v":""},"Hlavní žadatel",null,null,null,null,"NEBO",null,null,null,{"$f":"IF(zPojistenySpolu=\"X\",\"X\",\"\")","v":""},"Spolužadatel: "]
[null,null,null,null,null,null,null,null,null,null,null,null,null,null,null,null,null,null,null,null,null,null,null,null,null,null,null,null,null,null,null,null,null,null,null,null,null,null,"jméno a příjmení"]
[null,null,null,null,null,null,null,null,null,null,{"$f":"IF(zSoupborA=\"X\",IF(CardifTyp=\"Navýšením úvěru\",\"X\",\"\"),\"\")","v":""},"úhrada navýšením úvěru",null,null,null,null,null,null,null,null,{"$f":"IF(zSoupborA=\"X\",IF(CardifTyp=\"Z vlastních zdrojů\",\"X\",\"\"),\"\")","v":""},"úhrada z účtu"]
[]
[null,"Sjednaným pojištěním jsou kryta následující rizika, která jsou po celou pojistnou dobu neměnná:"]
[null,null,{"$f":"IF(zJpA=\"X\",\"X\",\"\")","v":""},"Balíček pojištění JP A: Smrt a pracovní neschopnost"]
[]
[null,null,{"$f":"IF(zJpB=\"X\",\"X\",\"\")","v":""},"Balíček pojištění JP B: Smrt a ztráta zaměstnání"]
[]
[null,null,{"$f":"IF(zJpC=\"X\",\"X\",\"\")","v":""},"Balíček pojištění JP C: Smrt a invalidita třetího stupně"]
[]
[null,"Prohlášení společné pro všechny balíčky pojištění "]
[null,"Podpisem potvrzuji, že splňuji tyto podmínky pro přijetí do pojištění:"]
[null," -","jsem seznámen(a) a souhlasím s obsahem Pojistné smlouvy č. 19100964/2015 a Zvláštních pojistných podmínek pro skupinové pojištění schopnosti splácet "]
[null,null,"hypoteční úvěr s jednorázovým pojistným č.j.: 02/2015"]
[null," -","dosáhl(a) jsem věku 18 let a nepřekročil(a) jsem věk 60 let, u hypotečního úvěru ve výši od 5.000.001 Kč jsem nepřekročil(a) věk 55 let"]
[null," -","nejsem v pracovní neschopnosti, nejsem v pravidelné lékařské péči nebo pod pravidelným lékařským dohledem v důsledku zjištěného onemocnění"]
[null," -","nejsem účastníkem řízení o přiznání jakéhokoliv stupně invalidity (invalidního důchodu)"]
[null," -","nebyl mi, a to ani v minulosti, přiznán starobní důchod nebo invalidní důchod pro jakýkoliv stupeň invalidity"]
[null," -","nebyl mi, a to ani v minulosti, přiznán starobní důchod nebo invalidní důchod pro jakýkoliv stupeň invalidity"]
[null," -","souhlasím s tím, že oprávněnou osobou pro výplatu pojistného plnění je UniCredit Bank Czech Republic and Slovakia, a.s. (dále jen „UniCredit Bank“)"]
[null,"V případě sjednání balíčku pojištění JP A dále podpisem potvrzuji, že jsem zaměstnán(a) v pracovním poměru nebo vykonávám samostatnou výdělečnou činnost"]
[null,"V případě sjednání balíčku pojištění JP B dále podpisem potvrzuji, že:"]
[null," -","jsem zaměstnán(a) v pracovním poměru na dobu neurčitou a nejsem ve zkušební době"]
[null," -","nevedu jednání o skončení pracovního poměru dohodou "]
[null," -","nepodal(a) jsem výpověď z pracovního poměru, ani mi nebyla dána výpověď z pracovního poměru ze strany zaměstnavatele"]
[null," -","nezrušil(a) jsem okamžitě pracovní poměr, ani mi nebyl okamžitě zrušen pracovní poměr ze strany zaměstnavatele"]
[null," -","nejsem si vědom(a) zařazení mezi zaměstnance, se kterými by mohl být v příštích 12 měsících rozvázán prac. poměr z důvodu organizačních změn nebo snižování počtu zaměstnanců"]
[]
[null,"Další prohlášení společné pro všechny balíčky pojištění"]
[null,"1.  ","Pro účely pojišťovací činnosti a dalších činností, ke kterým jsou Pojistitelé v souladu s právními předpisy oprávněni"]
[null,"Zájemce o pojištění:"]
[null,"a)","uděluje souhlas, aby jeho osobní údaje včetně rodného čísla, údajů o zdravotním stavu a další sdělené údaje byly zpracovávány Českou pojišťovnou a.s. a AXA životní pojišťovnou a.s. (dále jen „Pojistitelé“) jako správci osobních údajů a jejich smluvními zpracovateli splňujícími podmínky zákona č. 101/2000 Sb., o ochraně osobních údajů, ve znění pozdějších předpisů (dále jen „zákona“) pro účely pojišťovací činnosti a dalších činností, ke kterým jsou Pojistitelé v souladu s právními předpisy oprávněni, a to po dobu nezbytně nutnou k realizaci a ochraně práv a povinností plynoucích z pojištění;"]
[null,"b)","výslovně souhlasí, aby Pojistitelé získávali údaje o jeho zdravotním stavu, zjišťovali a přezkoumávali jeho zdravotní stav nebo příčinu smrti;"]
[null,"c)","stvrzuje, že je poučen o tom, že poskytnutí osobních údajů Pojistitelům je dobrovolné, avšak v rozsahu, ve kterém jsou Pojistitelé povinni tyto údaje zpracovávat na základě zákona č. 89/2012 Sb. občanského zákoníku a na základě zákona č. 253/2008 Sb. o některých opatřeních proti legalizaci výnosů z trestné činnosti a financování terorismu (dále jen „AML zákon“), příp. dalších zákonů, je poskytnutí některých, zejména adresních a identifikačních údajů nezbytné pro sjednání pojištění a pro plnění práv a povinností z něj vyplývajících;"]
[null,"d)","bere na vědomí, že poskytnutí ostatních dobrovolně sdělených osobních údajů bude považováno za výslovné udělení souhlasu se správou a zpracováním takových osobních údajů;"]
[null,"e)","stvrzuje, že byl ve smyslu zákona, informován o svých právech a o povinnostech správce, zejména o právu přístupu k osobním údajům, jakož i o dalších právech dle tohoto zákona;"]
[null,"f)","uděluje souhlas se zpracováním údajů o úvěru ze smlouvy o úvěru uzavřené s UniCredit Bank;"]
[null,"g)","pro případ sdělení elektronického kontaktu uděluje souhlas, aby byl kontaktován elektronickou formou i v záležitostech týkajících se dříve sjednaných pojištění;"]
[null,"h)","souhlasí, aby Pojistitelé zpracovávali jeho osobní údaje, a to i s přiřazováním dalších údajů a s jejich předáváním také dalším členům skupiny Generali a skupiny AXA a jejich spolupracujícím obchodním partnerům, příp. i do jiných států."]
[null,"2. ","Pro účely zmocnění a zproštění mlčenlivosti"]
[null,"Zájemce o pojištění:"]
[null,"a)","za účelem zjišťování zdravotního stavu při sjednání nebo změně pojištění a pro případ šetření škodné události zprošťuje státní zastupitelství, policii a další orgány činné v trestním řízení, hasičský záchranný sbor, lékaře, zdravotnická zařízení, záchrannou službu a zdravotní pojišťovny povinnosti mlčenlivosti; zavazuje se informovat Pojistitele o ošetřujících lékařích a zdravotnických zařízeních a zajišťovat od nich požadované zprávy;"]
[null,"b)","zmocňuje Pojistitele, resp. jejich pověřenou osobu, aby ve všech řízeních probíhajících v souvislosti se škodnou událostí mohli nahlížet do soudních, policejních, případně jiných úředních spisů a zhotovovat z nich kopie či výpisy;"]
[null,"c)","zmocňuje Pojistitele k nahlédnutí do podkladů jiných pojišťoven v souvislosti s šetřením škodných událostí a s výplatou pojistných plnění;"]
[null,"d)","uděluje Pojistitelům souhlas, aby v zájmu kompatibility péče o klienta v rámci skupiny Generali a skupiny AXA sdělovali informace o tom, zda je pojištěn, a základní pojistně technické informace týkající se sjednaného pojištění a pojistných událostí společnostem skupiny Generali, skupiny AXA a spolupracujícím obchodním partnerům, jejichž seznam je uveden na internetových stránkách Pojistitelů; "]
[null,"e)","souhlasí s poskytováním vybraných informací o jeho pojištění ostatním členům skupiny Generali a skupiny AXA. Souhlasí, aby byl kontaktován elektronickými prostředky (e-mail, SMS apod.)."]
[null,"Výše uvedené souhlasy a zmocnění uděluje zájemce o pojištění i ve vztahu ke dříve sjednaným pojištěním a vztahují se i na dobu po jeho smrti."]
[null,"Zájemce o pojištění prohlašuje, že s předloženou nabídkou pojištění souhlasí a že všechna jeho prohlášení (odpovědi na písemné dotazy Pojistitelů) zde uvedená jsou pravdivá a úplná. "]
[null,"Zájemce o pojištění si je vědom, že podmínky přijetí do pojištění musí splnit ke dni vzniku pojištění, vyjde-li najevo, že nesplnil tyto podmínky a neoznámil to UniCredit Bank, mohou Pojistitelé odstoupit od pojištění nebo odmítnout pojistné plnění."]
[null,"Informace pro zájemce o pojištění"]
[null,"Pojistitelé v postavení správců osobních údajů, příp. jejich smluvní zpracovatelé, zpracovávají osobní údaje v souladu se zákonem č. 101/2000 Sb., o ochraně osobních údajů, ve znění pozdějších předpisů (dále jen „zákon“), a to automatizovaným způsobem i manuálně. Osobní údaje jsou zpracovávány pro účely pojišťovací činnosti a dalších činností vymezených zákonem č. 277/2009 Sb., o pojišťovnictví, ve znění pozdějších předpisů. Pojistitelé zpracovávají pouze přesné osobní údaje získané v souladu se zákonem a má povinnost zpracovávané osobní údaje aktualizovat. Za tím účelem zájemce o pojištění bezodkladně nahlásí jakoukoliv jejich změnu. Zájemce o pojištění má právo požádat Pojistitele o informaci o zpracování svých osobních údajů, a pokud se domnívá, že jsou jeho osobní údaje zpracovávány v rozporu se zákonem nebo s ochranou soukromého a osobního života, může požádat Pojistitele o vysvětlení, resp. požadovat odstranění závadného stavu; je-li jeho žádost oprávněná, Pojistitelé závadný stav neprodleně odstraní. V případě nevyhovění jeho žádosti má zájemce o pojištění možnost obrátit se na Úřad pro ochranu osobních údajů."]
[null,"V ",null,null,null,null,null,null,null,null,null,null,null,null,null,"dne "]
[null,null,null,null,null,null,null,null,null,null,null,null,null,null,null,null,null,null,null,null,null,null,null,null,null,null,null,"podpis zájemce o pojištění"]
[]
[]
[]
[]
[]
[]
[]
[null,"PŘIHLÁŠKA DO POJIŠTĚNÍ\nSKUPINOVÉ POJIŠTĚNÍ SCHOPNOSTI SPLÁCET HYPOTEČNÍ ÚVĚR S BĚŽNÝM POJISTNÝM"]
[]
[null,"ZÁJEMCE O POJIŠTĚNÍ:",null,null,null,null,null,null,null,null,{"$f":"IF(zPojistenyHlavni=\"X\",\"X\",\"\")","v":""},"Hlavní žadatel",null,null,null,null,"NEBO",null,null,null,{"$f":"IF(zPojistenySpolu=\"X\",\"X\",\"\")","v":""},"Spolužadatel: "]
[null,null,null,null,null,null,null,null,null,null,null,null,null,null,null,null,null,null,null,null,null,null,null,null,null,null,null,null,null,null,null,null,null,null,null,null,null,null,"jméno a příjmení"]
[]
[null,"Sjednaným pojištěním jsou kryta následující rizika, která jsou po celou pojistnou dobu neměnná:"]
[null,null,{"$f":"IF(zMes=\"X\",\"X\",\"\")","v":""},"Soubor pojištění A: Úmrtí, invalidita III. stupně a pracovní neschopnost"]
[]
[null,null,{"$f":"IF(zMes=\"X\",\"X\",\"\")","v":""},"Soubor pojištění B: Úmrtí, invalidita III. stupně a pracovní neschopnost a ztráta zaměstnání"]
[]
[null,"Prohlášení společné pro všechny balíčky pojištění "]
[null,"Podpisem potvrzuji, že splňuji tyto podmínky pro přijetí do pojištění:"]
[null," -","jsem seznámen(a) a souhlasím s obsahem Pojistné smlouvy č. 19100965/2015 a Zvláštních pojistných podmínek pro skupinové pojištění schopnosti splácet "]
[null,null,"hypoteční úvěr s běžným pojistným č.j.: 03/2015"]
[null," -","dosáhl(a) jsem věku 18 let a nepřekročil(a) jsem věk 60 let, u hypotečního úvěru ve výši od 5.000.001 Kč jsem nepřekročil(a) věk 55 let"]
[null," -","nejsem v pracovní neschopnosti, nejsem v pravidelné lékařské péči nebo pod pravidelným lékařským dohledem v důsledku zjištěného onemocnění"]
[null," -","nejsem účastníkem řízení o přiznání jakéhokoliv stupně invalidity (invalidního důchodu)"]
[null," -","nebyl mi, a to ani v minulosti, přiznán starobní důchod nebo invalidní důchod pro jakýkoliv stupeň invalidity, ani mi nevznikl nárok na průkaz osoby se zdravotním postižením „ZTP/P“"]
[null," -","souhlasím s tím, že oprávněnou osobou pro výplatu pojistného plnění je UniCredit Bank Czech Republic and Slovakia, a.s. (dále jen „UniCredit Bank“)"]
[null,"V případě sjednání Souboru pojištění A dále podpisem potvrzuji, že jsem zaměstnán(a) v pracovním poměru nebo vykonávám samostatnou výdělečnou činnost"]
[null,"V případě sjednání Souboru pojištění B dále podpisem potvrzuji, že:"]
[null," -","jsem zaměstnán(a) v pracovním poměru na dobu neurčitou a nejsem ve zkušební době"]
[null," -","nevedu jednání o skončení pracovního poměru dohodou "]
[null," -","nepodal(a) jsem výpověď z pracovního poměru, ani mi nebyla dána výpověď z pracovního poměru ze strany zaměstnavatele"]
[null," -","nezrušil(a) jsem okamžitě pracovní poměr, ani mi nebyl okamžitě zrušen pracovní poměr ze strany zaměstnavatele"]
[null," -","nejsem si vědom(a) zařazení mezi zaměstnance, se kterými by mohl být v příštích 12 měsících rozvázán prac. poměr z důvodu organizačních změn nebo snižování počtu zaměstnanců"]
[]
[null,"Další prohlášení společné pro všechny balíčky pojištění"]
[null,"1.  ","Pro účely pojišťovací činnosti a dalších činností, ke kterým jsou Pojistitelé v souladu s právními předpisy oprávněni"]
[null,"Zájemce o pojištění:"]
[null,"a)","uděluje souhlas, aby jeho osobní údaje včetně rodného čísla, údajů o zdravotním stavu a další sdělené údaje byly zpracovávány Českou pojišťovnou a.s. a AXA životní pojišťovnou a.s. (dále jen „Pojistitelé“) jako správci osobních údajů a jejich smluvními zpracovateli splňujícími podmínky zákona č. 101/2000 Sb., o ochraně osobních údajů, ve znění pozdějších předpisů (dále jen „zákona“) pro účely pojišťovací činnosti a dalších činností, ke kterým jsou Pojistitelé v souladu s právními předpisy oprávněni, a to po dobu nezbytně nutnou k realizaci a ochraně práv a povinností plynoucích z pojištění;"]
[null,"b)","výslovně souhlasí, aby Pojistitelé získávali údaje o jeho zdravotním stavu, zjišťovali a přezkoumávali jeho zdravotní stav nebo příčinu smrti;"]
[null,"c)","stvrzuje, že je poučen o tom, že poskytnutí osobních údajů Pojistitelům je dobrovolné, avšak v rozsahu, ve kterém jsou Pojistitelé povinni tyto údaje zpracovávat na základě zákona č. 89/2012 Sb. občanského zákoníku a na základě zákona č. 253/2008 Sb. o některých opatřeních proti legalizaci výnosů z trestné činnosti a financování terorismu (dále jen „AML zákon“), příp. dalších zákonů, je poskytnutí některých, zejména adresních a identifikačních údajů nezbytné pro sjednání pojištění a pro plnění práv a povinností z něj vyplývajících;"]
[null,"d)","bere na vědomí, že poskytnutí ostatních dobrovolně sdělených osobních údajů bude považováno za výslovné udělení souhlasu se správou a zpracováním takových osobních údajů;"]
[null,"e)","stvrzuje, že byl ve smyslu zákona, informován o svých právech a o povinnostech správce, zejména o právu přístupu k osobním údajům, jakož i o dalších právech dle tohoto zákona;"]
[null,"f)","uděluje souhlas se zpracováním údajů o úvěru ze smlouvy o úvěru uzavřené s UniCredit Bank;"]
[null,"g)","pro případ sdělení elektronického kontaktu uděluje souhlas, aby byl kontaktován elektronickou formou i v záležitostech týkajících se dříve sjednaných pojištění;"]
[null,"h)","souhlasí, aby Pojistitelé zpracovávali jeho osobní údaje, a to i s přiřazováním dalších údajů a s jejich předáváním také dalším členům skupiny Generali a skupiny AXA a jejich spolupracujícím obchodním partnerům, příp. i do jiných států."]
[null,"2. ","Pro účely zmocnění a zproštění mlčenlivosti"]
[null,"Zájemce o pojištění:"]
[null,"a)","za účelem zjišťování zdravotního stavu při sjednání nebo změně pojištění a pro případ šetření škodné události zprošťuje státní zastupitelství, policii a další orgány činné v trestním řízení, hasičský záchranný sbor, lékaře, zdravotnická zařízení, záchrannou službu a zdravotní pojišťovny povinnosti mlčenlivosti; zavazuje se informovat Pojistitele o ošetřujících lékařích a zdravotnických zařízeních a zajišťovat od nich požadované zprávy;"]
[null,"b)","zmocňuje Pojistitele, resp. jejich pověřenou osobu, aby ve všech řízeních probíhajících v souvislosti se škodnou událostí mohli nahlížet do soudních, policejních, případně jiných úředních spisů a zhotovovat z nich kopie či výpisy;"]
[null,"c)","zmocňuje Pojistitele k nahlédnutí do podkladů jiných pojišťoven v souvislosti s šetřením škodných událostí a s výplatou pojistných plnění;"]
[null,"d)","uděluje Pojistitelům souhlas, aby v zájmu kompatibility péče o klienta v rámci skupiny Generali a skupiny AXA sdělovali informace o tom, zda je pojištěn, a základní pojistně technické informace týkající se sjednaného pojištění a pojistných událostí společnostem skupiny Generali, skupiny AXA a spolupracujícím obchodním partnerům, jejichž seznam je uveden na internetových stránkách Pojistitelů; "]
[null,"e)","souhlasí s poskytováním vybraných informací o jeho pojištění ostatním členům skupiny Generali a skupiny AXA. Souhlasí, aby byl kontaktován elektronickými prostředky (e-mail, SMS apod.)."]
[null,"Výše uvedené souhlasy a zmocnění uděluje zájemce o pojištění i ve vztahu ke dříve sjednaným pojištěním a vztahují se i na dobu po jeho smrti."]
[null,"Zájemce o pojištění prohlašuje, že s předloženou nabídkou pojištění souhlasí a že všechna jeho prohlášení (odpovědi na písemné dotazy Pojistitelů) zde uvedená jsou pravdivá a úplná. "]
[null,"Zájemce o pojištění si je vědom, že podmínky přijetí do pojištění musí splnit ke dni vzniku pojištění, vyjde-li najevo, že nesplnil tyto podmínky a neoznámil to UniCredit Bank, mohou Pojistitelé odstoupit od pojištění nebo odmítnout pojistné plnění."]
[null,"Informace pro zájemce o pojištění"]
[null,"Pojistitelé v postavení správců osobních údajů, příp. jejich smluvní zpracovatelé, zpracovávají osobní údaje v souladu se zákonem č. 101/2000 Sb., o ochraně osobních údajů, ve znění pozdějších předpisů (dále jen „zákon“), a to automatizovaným způsobem i manuálně. Osobní údaje jsou zpracovávány pro účely pojišťovací činnosti a dalších činností vymezených zákonem č. 277/2009 Sb., o pojišťovnictví, ve znění pozdějších předpisů. Pojistitelé zpracovávají pouze přesné osobní údaje získané v souladu se zákonem a má povinnost zpracovávané osobní údaje aktualizovat. Za tím účelem zájemce o pojištění bezodkladně nahlásí jakoukoliv jejich změnu. Zájemce o pojištění má právo požádat Pojistitele o informaci o zpracování svých osobních údajů, a pokud se domnívá, že jsou jeho osobní údaje zpracovávány v rozporu se zákonem nebo s ochranou soukromého a osobního života, může požádat Pojistitele o vysvětlení, resp. požadovat odstranění závadného stavu; je-li jeho žádost oprávněná, Pojistitelé závadný stav neprodleně odstraní. V případě nevyhovění jeho žádosti má zájemce o pojištění možnost obrátit se na Úřad pro ochranu osobních údajů."]
[]
[]
[]
[null,"V ",null,null,null,null,null,null,null,null,null,null,null,null,null,"dne "]
[null,null,null,null,null,null,null,null,null,null,null,null,null,null,null,null,null,null,null,null,null,null,null,null,null,null,null,"podpis zájemce o pojištění"]

{"sheet":"PrazdnaZadost","index":12,"n_rows":801,"n_cols":51,"rows_kept":801,"cut":false,"hidden":true,"merged":[[3,6,3,21],[3,29,3,40],[4,6,4,21],[4,29,4,40],[6,1,6,52],[11,2,11,16],[11,19,11,33],[11,36,11,51],[23,2,23,16],[23,19,23,51],[27,19,27,33],[27,36,27,39],[29,19,29,33],[29,36,29,51],[13,2,13,16],[13,19,13,33],[15,2,15,51],[20,2,20,16],[20,19,20,33],[20,36,20,51],[46,2,46,24],[46,27,46,51],[48,2,48,24],[48,27,48,37],[48,40,48,51],[50,2,50,24],[50,27,50,51],[32,2,32,51],[33,2,33,51],[34,2,34,51],[35,2,35,51],[37,2,37,24],[44,2,44,24],[44,27,44,37],[44,40,44,51],[61,1,61,51],[62,1,62,50],[65,2,65,17],[65,21,65,31],[68,1,68,21],[71,1,71,21],[54,1,54,51],[55,1,55,51],[56,1,56,51],[57,1,57,51],[58,1,58,51],[59,1,59,51],[78,1,78,52],[83,2,83,16],[83,19,83,33],[83,36,83,51],[85,2,85,16],[85,19,85,33],[73,1,73,16],[73,17,73,51],[75,6,75,21],[75,29,75,40],[76,6,76,21],[76,29,76,40],[99,19,99,33],[99,36,99,39],[101,19,101,33],[101,36,101,51],[104,2,104,51],[105,2,105,51],[87,2,87,51],[92,2,92,16],[92,19,92,33],[92,36,92,51],[95,2,95,16],[95,19,95,51],[119,2,119,24],[119,27,119,51],[121,2,121,24],[121,27,121,37],[121,40,121,51],[123,2,123,24],[123,27,123,51],[106,2,106,51],[107,2,107,51],[110,2,110,24],[117,2,117,24],[117,27,117,37],[117,40,117,51],[133,1,133,51],[134,1,134,50],[137,2,137,17],[137,21,137,31],[141,1,141,21],[145,1,145,21],[127,1,127,51],[128,1,128,51],[129,1,129,51],[130,1,130,51],[131,1,131,51],[132,1,132,51],[152,1,152,52],[157,2,157,16],[157,19,157,33],[157,36,157,51],[159,2,159,16],[159,19,159,33],[147,1,147,16],[147,17,147,51],[149,6,149,21],[149,29,149,40],[150,6,150,21],[150,29,150,40],[173,19,173,33],[173,36,173,39],[175,19,175,33],[175,36,175,51],[178,2,178,51],[179,2,179,51],[161,2,161,51],[166,2,166,16],[166,19,166,33],[166,36,166,51],[169,2,169,16],[169,19,169,51],[193,2,193,24],[193,27,193,51],[195,2,195,24],[195,27,195,37],[195,40,195,51],[197,2,197,24],[197,27,197,51],[180,2,180,51],[181,2,181,51],[184,2,184,24],[191,2,191,24],[191,27,191,37],[191,40,191,51],[207,1,207,51],[208,1,208,50],[211,2,211,17],[211,21,211,31],[215,1,215,21],[219,1,219,21],[201,1,201,51],[202,1,202,51],[203,1,203,51],[204,1,204,51],[205,1,205,51],[206,1,206,51],[226,1,226,52],[231,2,231,16],[231,19,231,33],[231,36,231,51],[233,2,233,16],[233,19,233,33],[221,1,221,16],[221,17,221,52],[223,6,223,21],[223,29,223,40],[224,6,224,21],[224,29,224,40],[247,19,247,33],[247,36,247,39],[249,19,249,33],[249,36,249,51],[252,2,252,51],[253,2,253,51],[235,2,235,51],[240,2,240,16],[240,19,240,33],[240,36,240,51],[243,2,243,16],[243,19,243,51],[267,2,267,24],[267,27,267,51],[269,2,269,24],[269,27,269,37],[269,40,269,51],[271,2,271,24],[271,27,271,51],[254,2,254,51],[255,2,255,51],[258,2,258,24],[265,2,265,24],[265,27,265,37],[265,40,265,51],[281,1,281,51],[282,1,282,50],[285,2,285,17],[285,21,285,31],[289,1,289,21],[293,1,293,21],[275,1,275,51],[276,1,276,51],[277,1,277,51],[278,1,278,51],[279,1,279,51],[280,1,280,51],[300,27,300,40],[302,1,302,52],[306,2,306,7],[306,13,306,18],[306,28,306,33],[306,39,306,44],[295,1,295,16],[295,17,295,51],[296,27,296,40],[297,9,297,24],[298,9,298,24],[299,9,299,24],[314,2,314,18],[314,28,314,44],[333,2,333,25],[333,28,333,51],[336,24,336,42],[342,2,342,25],[342,28,342,51],[308,2,308,25],[308,28,308,51],[310,2,310,25],[310,28,310,51],[312,2,312,18],[312,28,312,44],[348,3,348,5],[348,29,348,31],[351,9,351,25],[351,35,351,51],[352,9,352,17],[352,35,352,43],[344,2,344,4],[344,16,346,19],[344,21,346,24],[344,28,344,30],[344,42,346,45],[344,47,346,50],[360,16,360,19],[360,42,360,45],[364,16,364,23],[364,42,364,49],[368,16,368,23],[368,42,368,49],[353,9,353,25],[353,35,353,51],[358,16,358,23],[358,42,358,49],[359,16,359,19],[359,42,359,45],[376,2,376,11],[377,2,377,10],[377,14,377,22],[377,28,377,36],[377,40,377,48],[379,14,379,19],[379,40,379,45],[370,16,370,23],[370,42,370,49],[372,16,372,23],[372,42,372,49],[374,16,374,23],[374,42,374,49],[381,2,381,13],[381,14,381,19],[381,20,381,25],[381,28,381,39],[381,40,381,45],[381,46,381,51],[380,2,380,13],[380,14,380,19],[380,20,380,25],[380,28,380,39],[380,40,380,45],[380,46,380,51],[385,14,385,19],[385,40,385,45],[389,17,389,19],[389,23,389,32],[405,6,405,19],[407,2,407,51],[382,14,382,19],[382,40,382,45],[383,14,383,19],[383,40,383,45],[384,2,384,13],[384,14,384,19],[384,28,384,39],[384,40,384,45],[437,2,437,51],[438,2,438,51],[441,28,442,51],[443,28,443,51],[446,28,447,51],[447,2,447,25],[419,13,419,51],[420,13,420,22],[420,40,420,49],[430,13,430,51],[435,2,435,51],[436,2,436,51],[457,27,457,40],[458,9,458,24],[459,9,459,24],[460,9,460,24],[461,27,461,40],[463,1,463,52],[448,28,448,51],[451,2,451,25],[451,28,451,39],[451,40,451,51],[453,2,453,11],[453,14,453,25],[471,2,471,25],[471,28,471,51],[473,2,473,18],[473,28,473,44],[475,2,475,18],[475,28,475,44],[467,2,467,7],[467,13,467,18],[467,28,467,33],[467,39,467,44],[469,2,469,25],[469,28,469,51],[494,2,494,25],[494,28,494,51],[497,24,497,42],[503,2,503,25],[503,28,503,51],[505,2,505,4],[505,16,507,19],[505,21,507,24],[505,28,505,30],[505,42,507,45],[514,9,514,25],[514,35,514,51],[519,16,519,23],[519,42,519,49],[520,16,520,19],[520,42,520,45],[505,47,507,50],[509,3,509,5],[509,29,509,31],[512,9,512,25],[512,35,512,51],[513,9,513,17],[513,35,513,43],[531,16,531,23],[531,42,531,49],[533,16,533,23],[533,42,533,49],[535,16,535,23],[535,42,535,49],[521,16,521,19],[521,42,521,45],[525,16,525,23],[525,42,525,49],[529,16,529,23],[529,42,529,49],[542,46,542,51],[541,2,541,13],[541,14,541,19],[541,20,541,25],[541,28,541,39],[541,40,541,45],[541,46,541,51],[537,2,537,11],[538,2,538,10],[538,14,538,22],[538,28,538,36],[538,40,538,48],[540,14,540,19],[540,40,540,45],[543,14,543,19],[543,40,543,45],[544,14,544,19],[544,40,544,45],[545,2,545,13],[545,14,545,19],[545,28,545,39],[545,40,545,45],[542,2,542,13],[542,14,542,19],[542,20,542,25],[542,28,542,39],[542,40,542,45],[580,13,580,51],[581,13,581,22],[581,40,581,49],[591,13,591,51],[596,2,596,51],[597,2,597,51],[546,14,546,19],[546,40,546,45],[550,17,550,19],[550,23,550,32],[566,6,566,19],[568,2,568,51],[609,28,609,51],[612,2,612,25],[612,28,612,39],[612,40,612,51],[614,2,614,11],[614,14,614,25],[598,2,598,51],[599,2,599,51],[602,28,603,51],[604,28,604,51],[607,28,608,51],[608,2,608,25],[630,4,630,49],[631,8,631,36],[631,37,632,44],[632,8,632,36],[633,8,633,36],[633,37,634,44],[634,8,634,36],[617,1,617,52],[620,1,620,52],[623,1,623,52],[624,1,624,52],[625,1,625,52],[626,1,626,52],[635,8,635,36],[635,37,637,44],[636,8,636,36],[637,8,637,36],[644,7,647,14],[644,15,647,22],[644,23,647,29],[644,30,647,37],[644,38,647,45],[659,1,659,52],[661,1,661,52],[662,1,662,52],[664,1,664,52],[665,1,665,52],[667,1,667,52],[652,28,653,51],[654,28,654,51],[655,5,655,7],[656,1,656,52],[657,1,657,52],[658,1,658,52],[676,1,676,52],[678,1,678,52],[679,1,679,52],[680,1,680,52],[681,1,681,3],[682,1,682,3],[668,1,668,52],[669,1,669,52],[671,1,671,52],[672,1,672,52],[673,1,673,52],[675,1,675,52],[689,1,689,52],[690,1,690,3],[691,1,691,52],[692,1,692,3],[693,1,693,52],[694,1,694,52],[683,1,683,52],[684,1,684,3],[685,1,685,52],[686,1,686,3],[687,1,687,52],[688,1,688,3],[704,27,704,50],[707,27,708,50],[708,1,708,24],[709,27,709,50],[712,26,712,52],[717,1,717,52],[695,1,695,3],[696,1,696,52],[697,1,697,3],[698,1,698,52],[699,1,699,3],[702,27,703,50],[762,1,762,35],[764,3,764,10],[764,12,764,13],[764,14,764,18],[764,20,764,32],[765,20,765,32],[721,3,721,52],[740,3,740,52],[755,3,755,52],[756,3,756,52],[758,3,758,52],[760,3,760,52],[800,20,800,32],[769,26,769,52],[791,3,791,52],[792,3,792,52],[793,3,793,52],[795,3,795,52],[799,3,799,10],[799,12,799,13],[799,14,799,18],[799,20,799,32]]}
[]
[]
[null,null,"Vyplní Banka"]
[null,null,"Pracovník banky:",null,null,null,null,null,null,null,null,null,null,null,null,null,null,null,null,null,null,null,null,null,"Číslo klienta (NDG):"]
[null,null,"Pobočka (číslo):",null,null,null,null,null,null,null,null,null,null,null,null,null,null,null,null,null,null,null,null,null,"Číslo žádosti:"]
[]
[null,"ŽÁDOST O POSKYTNUTÍ HYPOTEČNÍHO ÚVĚRU"]
[null,null,"Vyplní klient"]
[null,null,"ÚDAJE O ŽADATELI/SPOLUŽADATELI* (DÁLE JEN \"ŽADATEL\")"]
[null,null,"Základní údaje"]
[null,null,"Jméno",null,null,null,null,null,null,null,null,null,null,null,null,null,null,null,null,"Příjmení",null,null,null,null,null,null,null,null,null,null,null,null,null,null,null,null,"Rodné číslo"]
[]
[null,null,"Datum narození",null,null,null,null,null,null,null,null,null,null,null,null,null,null,null,null,"Země narození (není-li ČR)",null,null,null,null,null,null,null,null,null,null,null,null,null,null,null,null,"Pohlaví"]
[null,null,null,null,null,null,null,null,null,null,null,null,null,null,null,null,null,null,null,null,null,null,null,null,null,null,null,null,null,null,null,null,null,null,null,null,null,"Muž",null,null,"Žena"]
[null,null,"Adresa trvalého pobytu (ulice, č.p., město, PSČ, země)"]
[]
[null,null,"Doklad totožnosti"]
[null,null,"Typ dokladu"]
[null,null,null,"Občanský průkaz",null,null,null,null,null,null,"Cestovní pas",null,null,null,null,null,"Identifikační karta občana EU"]
[null,null,"Číslo dokladu",null,null,null,null,null,null,null,null,null,null,null,null,null,null,null,null,"Země vydání dokladu (není-li ČR)",null,null,null,null,null,null,null,null,null,null,null,null,null,null,null,null,"Datum vydání dokladu"]
[]
[null,null,"Kontaktní údaje"]
[null,null,"Telefon",null,null,null,null,null,null,null,null,null,null,null,null,null,null,null,null,"E-mail"]
[]
[]
[null,null,"ÚDAJE O POŽADOVANÉM  ÚVĚRU"]
[null,null,"Účel úvěru refinancování",null,null,null,null,null,null,null,null,null,null,null,null,null,null,null,null,"Celková výše úvěru v Kč**",null,null,null,null,null,null,null,null,null,null,null,null,null,null,null,null,"Počet splátek"]
[null,null,null,"Ano",null,null,null,"Ne"]
[null,null,"Úvěr v kombinaci s neúčelovou částí***",null,null,null,null,null,null,null,null,null,null,null,null,null,null,null,null,"Výše účelové části v Kč",null,null,null,null,null,null,null,null,null,null,null,null,null,null,null,null,"Výše neúčelové části v Kč"]
[null,null,null,"Ano",null,null,null,"Ne"]
[]
[null,null,"PROHLÁŠENÍ ŽADATELE "]
[null,null,"Žadatel prohlašuje, že veškeré údaje uvedené v této žádosti o poskytnutí úvěru, resp. v dokumentech přiložených, jsou úplné a odpovídají skutečnosti a že nezamlčel žádnou relevantní skutečnost, která by mohla ovlivnit rozhodnutí UniCredit Bank Czech Republic and Slovakia, a.s. (dále jen „Banka“) při poskytnutí úvěru. \n\n\n\n"]
[null,null,"Dále Žadatel prohlašuje, že je plně svéprávný a že ke dni podání této žádosti o poskytnutí úvěru není v prodlení vůči státu nebo jinému subjektu s úhradou daní či poplatků, úhradou pojistného na sociální zabezpečení, zdravotní pojištění, úhradou cla nebo jiných povinných plateb."]
[null,null,"Žadatel souhlasí s tím, aby Banka získala informace o jeho bonitě (zahrnující zejména informaci o povaze a rozsahu případného porušení dřívějších závazků), platební morálce a důvěryhodnosti, které jsou nutné k posouzení žádosti o poskytnutí úvěru, a to z registrů sdružení SOLUS (www.solus.cz), jehož je Banka členem.\n"]
[null,null,"Žadatel potvrzuje, že se seznámil s \"Poučením o zpracování osobních údajů podle § 11 zákona č. 101/2000 Sb., o ochraně osobních údajů\", které je k dispozici mj. na webových stránkách a pobočkách Banky, zejména výslovně bere na vědomí, že Banka může jeho osobní údaje zpracovávat i prostřednictvím zpracovatelů se sídlem v členských státech Evropské unie, zejm. UniCredit Business Integrated Solutions S.C.p.A., Itálie. Veškerá místa, na kterých dochází ke zpracování osobních údajů Bankou nebo zpracovateli Banky, jsou nahlášena jako místa zpracování osobních údajů u Úřadu pro ochranu osobních údajů."]
[]
[]
[null,null,"Místo, datum",null,null,null,null,null,null,null,null,null,null,null,null,null,null,null,null,null,null,null,null,null,null,null,null,"Podpis Žadatele"]
[null,null,"* Nehodící se škrtněte"]
[null,null,"** Včetně všech nákladů, které budou z úvěru hrazeny (životní pojištění, poplatky atd.)"]
[null,null,"*** Hypoteční úvěr Twin (rezidenční hypoteční úvěr kombinovaný s neúčelovou částí)"]
[null,null,"Vyplní Banka / Pověřený zástupce Banky / Třetí strana - rozdělit"]
[null,null,"Totožnost ověřil (jméno, příjmení):",null,null,null,null,null,null,null,null,null,null,null,null,null,null,null,null,null,null,null,null,null,null,null,null,"Dne:",null,null,null,null,null,null,null,null,null,null,null,null,"Podpis:"]
[]
[null,null,"Název (jméno) 3P:",null,null,null,null,null,null,null,null,null,null,null,null,null,null,null,null,null,null,null,null,null,null,null,null,"Jméno a příjmení makléře:"]
[]
[null,null,"Přidělené ID 3P:",null,null,null,null,null,null,null,null,null,null,null,null,null,null,null,null,null,null,null,null,null,null,null,null,"IČ (popř. RČ) makléře",null,null,null,null,null,null,null,null,null,null,null,null,"Evid. č. makléře"]
[]
[null,null,"Telefon makléře:",null,null,null,null,null,null,null,null,null,null,null,null,null,null,null,null,null,null,null,null,null,null,null,null,"E-mail makléře:"]
[]
[]
[]
[null,"SOUHLAS se zpracováním osobních údajů a použitím rodného čísla"]
[null,"V souvislosti s uzavřením/žádostí o uzavření smlouvy mezi mnou a UniCredit Bank Czech Republic and Slovakia, a.s. (dále jen „Smlouva“ a „Banka“) souhlasím s tím, aby Banka za níže uvedeným účelem shromažďovala, zpracovávala a uchovávala mé osobní údaje, tj. jméno, příjmení, datum narození, rodné číslo, adresu, údaje o identifikačním dokladu a IČ (dále jen „osobní údaje“), a to způsobem, a za podmínek uvedených v Informačním Memorandu Bankovního registru klientských informací a Nebankovního registru klientských informací (dále jen „Informační Memorandum“) a v Poučení o registrech Sdružení SOLUS (též jen „Poučení“)."]
[null,"Dále souhlasím, aby Banka mé osobní údaje předávala Sdružení SOLUS k dalšímu zpracování v „Pozitivním registru sdružení SOLUS“ (též jen „Pozitivní registr“) a v Registru FO Sdružení SOLUS (též jen „Registr FO“) k dalšímu shromažďování, zpracovávání a uchovávání. Souhlasím, aby Sdružení SOLUS vytvořilo informační soubor mých osobních údajů od všech členských bank, případně též společně s dalšími mými veřejně dostupnými osobními údaji (např. mé osobní údaje obsažené v Insolvenčním rejstříku), a v rámci tohoto informačního souboru mých osobních údajů provádělo statistická vyhodnocení mé bonity a důvěryhodnosti. Souhlasím, aby Sdružení SOLUS mé osobní údaje (ve formě informačního souboru včetně údajů o statistických vyhodnoceních mé bonity a důvěryhodnosti) zpřístupnilo formou on-line dotazů všem oprávněným uživatelům (členům sdružení SOLUS) Pozitivního registru a Registru FO, tedy i Bance, a to vždy v rozsahu a za podmínek uvedeném pro každý z těchto registrů v Poučení."]
[null,"Souhlasím, aby Banka i opakovaně získávala informace o mé bonitě, platební morálce a důvěryhodnosti z Pozitivního registru a Registru FO. Souhlasím, aby všichni oprávnění uživatelé Pozitivního registru anebo Registru FO, kterým byly zpřístupněny mé osobní údaje, tyto používali, a to případně spolu s dalšími mými osobními údaji, jež oprávněně zpracovávají."]
[null,"Účelem zpracování osobních údajů v Pozitivním registru a Registru FO je splnění povinnosti odpovědného poskytování úvěrů a jiných obchodů Banky, zajištění vzájemného informování oprávněných uživatelů Pozitivního registru a Registru FO o mé bonitě, důvěryhodnosti a platební morálce, posuzování mé bonity, důvěryhodnosti a platební morálky ze strany oprávněných uživatelů Pozitivního registru a Registru FO, a to i opakovaně, jakož i ochrana práv Banky a ostatních členů sdružení SOLUS. Kromě předešlého je účelem zpracování mých osobních údajů na základě tohoto souhlasu rovněž zajištění vzájemného informování oprávněných uživatelů Bankovního registru klientských informací (dále jen „BRKI“) a Nebankovního registru klientských informací (dále jen „NRKI“) o mé bonitě, důvěryhodnosti a platební morálce a umožnění (a to i opakovaného) posuzování mé bonity, důvěryhodnosti a platební morálky ze strany oprávněných uživatelů BRKI a NRKI. Způsob, rozsah a podmínky vzájemného informování oprávněných uživatelů BRKI a NRKI jsou uvedeny v Informačním Memorandu."]
[null,"Souhlas uděluji na dobu 4 let ode dne jeho udělení. V případě, že mezi mnou [nebo žadatelem, pokud jde o ručitele, spolužadatele nebo zákonného zástupce] a Bankou byla nebo bude uzavřena Smlouva, uděluji tento souhlas na dobu jejího trvání a na dobu dalších 4 let od splnění veškerých mých finančních závazků z uzavřené Smlouvy, pokud tyto závazky zaniknou splněním nebo způsobem nahrazujícím splnění, resp. od zániku Smlouvy, pokud finanční závazky ze Smlouvy zaniknou jinak. "]
[null,"Před podpisem tohoto souhlasu jsem se seznámil(a) s Informačním Memorandem, které obsahuje i poučení o mých právech v souvislosti se zpracováním mých osobních údajů v rámci BRKI i pro účely vzájemného informování se uživatelů BRKI a/nebo NRKI o bonitě, důvěryhodnosti či platební morálce jejich klientů. Před podpisem tohoto souhlasu jsem rovněž byl(a) informován(a), že aktuální znění Informačního Memoranda mohu kdykoli získat na informační lince, pobočkách a na webových stránkách banky www.unicreditbank.cz nebo na informační lince a webových stránkách provozovatele registru www.cbcb.cz."]
[]
[null,"Dále prohlašuji, že jsem se seznámil(a) s  dokumentem \"POUČENÍ o registrech Sdružení SOLUS\", jehož obsahem je: (i) vysvětlení pojmu informační soubor, a to zvlášť pro Pozitivní registr a Registr FO, (ii) definice dalších mých osobních údajů, které mohou vzniknout při zpracování, (iii) popis fungování Pozitivního registru a Registru FO, (iv) identifikace subjektů či osob, které mohou mít přístup k mým osobním údajům při jejich zpracování  a (v) poučení o mých právech (§ 11 a § 12 zákona o ochraně osobních údajů č. 101/2000 Sb.) a nárocích (§ 21 zákona č. 101/2000 Sb.) v souvislosti se zpracováním mých osobních údajů v rámci pozitivního registru SOLUS. Byl(a) jsem informován(a), že aktuální znění Poučení mohu kdykoli získat na informační lince, pobočkách a webových stránkách banky www.unicreditbank.cz nebo na informační lince a webových stránkách sdružení SOLUS www.solus.cz."]
[null,"Potvrzuji, že jsem byl(a) Bankou poučen(a) o svých nárocích vůči porušiteli dle § 21 zákona č. 101/2000 Sb. "]
[null,"Po uzavření Smlouvy s Bankou se tento souhlas stává její nedílnou součástí."]
[]
[null,"V",null,null,null,null,null,null,null,null,null,null,null,null,null,null,null,null,null,"dne"]
[]
[]
[null,"Podpis žadatele"]
[]
[]
[null,"Podpis spolužadatele"]
[]
[null,"Jméno a podpis zástupce banky, který podpis/y ověřil:"]
[null,null,"Vyplní Banka"]
[null,null,"Pracovník banky:",null,null,null,null,null,null,null,null,null,null,null,null,null,null,null,null,null,null,null,null,null,"Číslo klienta (NDG):"]
[null,null,"Pobočka (číslo):",null,null,null,null,null,null,null,null,null,null,null,null,null,null,null,null,null,null,null,null,null,"Číslo žádosti:"]
[]
[null,"ŽÁDOST O POSKYTNUTÍ HYPOTEČNÍHO ÚVĚRU"]
[null,null,"Vyplní klient"]
[null,null,"ÚDAJE O ŽADATELI/SPOLUŽADATELI* (DÁLE JEN \"ŽADATEL\")"]
[null,null,"Základní údaje"]
[null,null,"Jméno",null,null,null,null,null,null,null,null,null,null,null,null,null,null,null,null,"Příjmení",null,null,null,null,null,null,null,null,null,null,null,null,null,null,null,null,"Rodné číslo"]
[]
[null,null,"Datum narození",null,null,null,null,null,null,null,null,null,null,null,null,null,null,null,null,"Země narození (není-li ČR)",null,null,null,null,null,null,null,null,null,null,null,null,null,null,null,null,"Pohlaví"]
[null,null,null,null,null,null,null,null,null,null,null,null,null,null,null,null,null,null,null,null,null,null,null,null,null,null,null,null,null,null,null,null,null,null,null,null,null,"Muž",null,null,"Žena"]
[null,null,"Adresa trvalého pobytu (ulice, č.p., město, PSČ, země)"]
[]
[null,null,"Doklad totožnosti"]
[null,null,"Typ dokladu"]
[null,null,null,"Občanský průkaz",null,null,null,null,null,null,"Cestovní pas",null,null,null,null,null,"Identifikační karta občana EU"]
[null,null,"Číslo dokladu",null,null,null,null,null,null,null,null,null,null,null,null,null,null,null,null,"Země vydání dokladu (není-li ČR)",null,null,null,null,null,null,null,null,null,null,null,null,null,null,null,null,"Datum vydání dokladu"]
[]
[null,null,"Kontaktní údaje"]
[null,null,"Telefon",null,null,null,null,null,null,null,null,null,null,null,null,null,null,null,null,"E-mail"]
[]
[]
[null,null,"ÚDAJE O POŽADOVANÉM  ÚVĚRU"]
[null,null,"Účel úvěru refinancování",null,null,null,null,null,null,null,null,null,null,null,null,null,null,null,null,"Celková výše úvěru v Kč**",null,null,null,null,null,null,null,null,null,null,null,null,null,null,null,null,"Počet splátek"]
[null,null,null,"Ano",null,null,null,"Ne"]
[null,null,"Úvěr v kombinaci s neúčelovou částí***",null,null,null,null,null,null,null,null,null,null,null,null,null,null,null,null,"Výše účelové části v Kč",null,null,null,null,null,null,null,null,null,null,null,null,null,null,null,null,"Výše neúčelové části v Kč"]
[null,null,null,"Ano",null,null,null,"Ne"]
[]
[null,null,"PROHLÁŠENÍ ŽADATELE "]
[null,null,"Žadatel prohlašuje, že veškeré údaje uvedené v této žádosti o poskytnutí úvěru, resp. v dokumentech přiložených, jsou úplné a odpovídají skutečnosti a že nezamlčel žádnou relevantní skutečnost, která by mohla ovlivnit rozhodnutí UniCredit Bank Czech Republic and Slovakia, a.s. (dále jen „Banka“) při poskytnutí úvěru. \n\n\n\n"]
[null,null,"Dále Žadatel prohlašuje, že je plně svéprávný a že ke dni podání této žádosti o poskytnutí úvěru není v prodlení vůči státu nebo jinému subjektu s úhradou daní či poplatků, úhradou pojistného na sociální zabezpečení, zdravotní pojištění, úhradou cla nebo jiných povinných plateb."]
[null,null,"Žadatel souhlasí s tím, aby Banka získala informace o jeho bonitě (zahrnující zejména informaci o povaze a rozsahu případného porušení dřívějších závazků), platební morálce a důvěryhodnosti, které jsou nutné k posouzení žádosti o poskytnutí úvěru, a to z registrů sdružení SOLUS (www.solus.cz), jehož je Banka členem.\n"]
[null,null,"Žadatel potvrzuje, že se seznámil s \"Poučením o zpracování osobních údajů podle § 11 zákona č. 101/2000 Sb., o ochraně osobních údajů\", které je k dispozici mj. na webových stránkách a pobočkách Banky, zejména výslovně bere na vědomí, že Banka může jeho osobní údaje zpracovávat i prostřednictvím zpracovatelů se sídlem v členských státech Evropské unie, zejm. UniCredit Business Integrated Solutions S.C.p.A., Itálie. Veškerá místa, na kterých dochází ke zpracování osobních údajů Bankou nebo zpracovateli Banky, jsou nahlášena jako místa zpracování osobních údajů u Úřadu pro ochranu osobních údajů."]
[]
[]
[]
[null,null,"Místo, datum",null,null,null,null,null,null,null,null,null,null,null,null,null,null,null,null,null,null,null,null,null,null,null,null,"Podpis Žadatele"]
[null,null,"* Nehodící se škrtněte"]
[null,null,"** Včetně všech nákladů, které budou z úvěru hrazeny (životní pojištění, poplatky atd.)"]
[null,null,"*** Hypoteční úvěr Twin (rezidenční hypoteční úvěr kombinovaný s neúčelovou částí)"]
[null,null,"Vyplní Banka / Pověřený zástupce Banky / Třetí strana - rozdělit"]
[null,null,"Totožnost ověřil (jméno, příjmení):",null,null,null,null,null,null,null,null,null,null,null,null,null,null,null,null,null,null,null,null,null,null,null,null,"Dne:",null,null,null,null,null,null,null,null,null,null,null,null,"Podpis:"]
[]
[null,null,"Název (jméno) 3P:",null,null,null,null,null,null,null,null,null,null,null,null,null,null,null,null,null,null,null,null,null,null,null,null,"Jméno a příjmení makléře:"]
[]
[null,null,"Přidělené ID 3P:",null,null,null,null,null,null,null,null,null,null,null,null,null,null,null,null,null,null,null,null,null,null,null,null,"IČ (popř. RČ) makléře",null,null,null,null,null,null,null,null,null,null,null,null,"Evid. č. makléře"]
[]
[null,null,"Telefon makléře:",null,null,null,null,null,null,null,null,null,null,null,null,null,null,null,null,null,null,null,null,null,null,null,null,"E-mail makléře:"]
[]
[]
[]
[null,"SOUHLAS se zpracováním osobních údajů a použitím rodného čísla"]
[null,"V souvislosti s uzavřením/žádostí o uzavření smlouvy mezi mnou a UniCredit Bank Czech Republic and Slovakia, a.s. (dále jen „Smlouva“ a „Banka“) souhlasím s tím, aby Banka za níže uvedeným účelem shromažďovala, zpracovávala a uchovávala mé osobní údaje, tj. jméno, příjmení, datum narození, rodné číslo, adresu, údaje o identifikačním dokladu a IČ (dále jen „osobní údaje“), a to způsobem, a za podmínek uvedených v Informačním Memorandu Bankovního registru klientských informací a Nebankovního registru klientských informací (dále jen „Informační Memorandum“) a v Poučení o registrech Sdružení SOLUS (též jen „Poučení“)."]
[null,"Dále souhlasím, aby Banka mé osobní údaje předávala Sdružení SOLUS k dalšímu zpracování v „Pozitivním registru sdružení SOLUS“ (též jen „Pozitivní registr“) a v Registru FO Sdružení SOLUS (též jen „Registr FO“) k dalšímu shromažďování, zpracovávání a uchovávání. Souhlasím, aby Sdružení SOLUS vytvořilo informační soubor mých osobních údajů od všech členských bank, případně též společně s dalšími mými veřejně dostupnými osobními údaji (např. mé osobní údaje obsažené v Insolvenčním rejstříku), a v rámci tohoto informačního souboru mých osobních údajů provádělo statistická vyhodnocení mé bonity a důvěryhodnosti. Souhlasím, aby Sdružení SOLUS mé osobní údaje (ve formě informačního souboru včetně údajů o statistických vyhodnoceních mé bonity a důvěryhodnosti) zpřístupnilo formou on-line dotazů všem oprávněným uživatelům (členům sdružení SOLUS) Pozitivního registru a Registru FO, tedy i Bance, a to vždy v rozsahu a za podmínek uvedeném pro každý z těchto registrů v Poučení."]
[null,"Souhlasím, aby Banka i opakovaně získávala informace o mé bonitě, platební morálce a důvěryhodnosti z Pozitivního registru a Registru FO. Souhlasím, aby všichni oprávnění uživatelé Pozitivního registru anebo Registru FO, kterým byly zpřístupněny mé osobní údaje, tyto používali, a to případně spolu s dalšími mými osobními údaji, jež oprávněně zpracovávají."]
[null,"Účelem zpracování osobních údajů v Pozitivním registru a Registru FO je splnění povinnosti odpovědného poskytování úvěrů a jiných obchodů Banky, zajištění vzájemného informování oprávněných uživatelů Pozitivního registru a Registru FO o mé bonitě, důvěryhodnosti a platební morálce, posuzování mé bonity, důvěryhodnosti a platební morálky ze strany oprávněných uživatelů Pozitivního registru a Registru FO, a to i opakovaně, jakož i ochrana práv Banky a ostatních členů sdružení SOLUS. Kromě předešlého je účelem zpracování mých osobních údajů na základě tohoto souhlasu rovněž zajištění vzájemného informování oprávněných uživatelů Bankovního registru klientských informací (dále jen „BRKI“) a Nebankovního registru klientských informací (dále jen „NRKI“) o mé bonitě, důvěryhodnosti a platební morálce a umožnění (a to i opakovaného) posuzování mé bonity, důvěryhodnosti a platební morálky ze strany oprávněných uživatelů BRKI a NRKI. Způsob, rozsah a podmínky vzájemného informování oprávněných uživatelů BRKI a NRKI jsou uvedeny v Informačním Memorandu."]
[null,"Souhlas uděluji na dobu 4 let ode dne jeho udělení. V případě, že mezi mnou [nebo žadatelem, pokud jde o ručitele, spolužadatele nebo zákonného zástupce] a Bankou byla nebo bude uzavřena Smlouva, uděluji tento souhlas na dobu jejího trvání a na dobu dalších 4 let od splnění veškerých mých finančních závazků z uzavřené Smlouvy, pokud tyto závazky zaniknou splněním nebo způsobem nahrazujícím splnění, resp. od zániku Smlouvy, pokud finanční závazky ze Smlouvy zaniknou jinak. "]
[null,"Před podpisem tohoto souhlasu jsem se seznámil(a) s Informačním Memorandem, které obsahuje i poučení o mých právech v souvislosti se zpracováním mých osobních údajů v rámci BRKI i pro účely vzájemného informování se uživatelů BRKI a/nebo NRKI o bonitě, důvěryhodnosti či platební morálce jejich klientů. Před podpisem tohoto souhlasu jsem rovněž byl(a) informován(a), že aktuální znění Informačního Memoranda mohu kdykoli získat na informační lince, pobočkách a na webových stránkách banky www.unicreditbank.cz nebo na informační lince a webových stránkách provozovatele registru www.cbcb.cz."]
[null,"Dále prohlašuji, že jsem se seznámil(a) s  dokumentem \"POUČENÍ o registrech Sdružení SOLUS\", jehož obsahem je: (i) vysvětlení pojmu informační soubor, a to zvlášť pro Pozitivní registr a Registr FO, (ii) definice dalších mých osobních údajů, které mohou vzniknout při zpracování, (iii) popis fungování Pozitivního registru a Registru FO, (iv) identifikace subjektů či osob, které mohou mít přístup k mým osobním údajům při jejich zpracování  a (v) poučení o mých právech (§ 11 a § 12 zákona o ochraně osobních údajů č. 101/2000 Sb.) a nárocích (§ 21 zákona č. 101/2000 Sb.) v souvislosti se zpracováním mých osobních údajů v rámci pozitivního registru SOLUS. Byl(a) jsem informován(a), že aktuální znění Poučení mohu kdykoli získat na informační lince, pobočkách a webových stránkách banky www.unicreditbank.cz nebo na informační lince a webových stránkách sdružení SOLUS www.solus.cz."]
[null,"Potvrzuji, že jsem byl(a) Bankou poučen(a) o svých nárocích vůči porušiteli dle § 21 zákona č. 101/2000 Sb. "]
[null,"Po uzavření Smlouvy s Bankou se tento souhlas stává její nedílnou součástí."]
[]
[null,"V",null,null,null,null,null,null,null,null,null,null,null,null,null,null,null,null,null,"dne"]
[]
[]
[]
[null,"Podpis žadatele"]
[]
[]
[]
[null,"Podpis spolužadatele"]
[]
[null,"Jméno a podpis zástupce banky, který podpis/y ověřil:"]
[null,null,"Vyplní Banka"]
[null,null,"Pracovník banky:",null,null,null,null,null,null,null,null,null,null,null,null,null,null,null,null,null,null,null,null,null,"Číslo klienta (NDG):"]
[null,null,"Pobočka (číslo):",null,null,null,null,null,null,null,null,null,null,null,null,null,null,null,null,null,null,null,null,null,"Číslo žádosti:"]
[]
[null,"ŽÁDOST O POSKYTNUTÍ HYPOTEČNÍHO ÚVĚRU"]
[null,null,"Vyplní klient"]
[null,null,"ÚDAJE O ŽADATELI/SPOLUŽADATELI* (DÁLE JEN \"ŽADATEL\")"]
[null,null,"Základní údaje"]
[null,null,"Jméno",null,null,null,null,null,null,null,null,null,null,null,null,null,null,null,null,"Příjmení",null,null,null,null,null,null,null,null,null,null,null,null,null,null,null,null,"Rodné číslo"]
[]
[null,null,"Datum narození",null,null,null,null,null,null,null,null,null,null,null,null,null,null,null,null,"Země narození (není-li ČR)",null,null,null,null,null,null,null,null,null,null,null,null,null,null,null,null,"Pohlaví"]
[null,null,null,null,null,null,null,null,null,null,null,null,null,null,null,null,null,null,null,null,null,null,null,null,null,null,null,null,null,null,null,null,null,null,null,null,null,"Muž",null,null,"Žena"]
[null,null,"Adresa trvalého pobytu (ulice, č.p., město, PSČ, země)"]
[]
[null,null,"Doklad totožnosti"]
[null,null,"Typ dokladu"]
[null,null,null,"Občanský průkaz",null,null,null,null,null,null,"Cestovní pas",null,null,null,null,null,"Identifikační karta občana EU"]
[null,null,"Číslo dokladu",null,null,null,null,null,null,null,null,null,null,null,null,null,null,null,null,"Země vydání dokladu (není-li ČR)",null,null,null,null,null,null,null,null,null,null,null,null,null,null,null,null,"Datum vydání dokladu"]
[]
[null,null,"Kontaktní údaje"]
[null,null,"Telefon",null,null,null,null,null,null,null,null,null,null,null,null,null,null,null,null,"E-mail"]
[]
[]
[null,null,"ÚDAJE O POŽADOVANÉM  ÚVĚRU"]
[null,null,"Účel úvěru refinancování",null,null,null,null,null,null,null,null,null,null,null,null,null,null,null,null,"Celková výše úvěru v Kč**",null,null,null,null,null,null,null,null,null,null,null,null,null,null,null,null,"Počet splátek"]
[null,null,null,"Ano",null,null,null,"Ne"]
[null,null,"Úvěr v kombinaci s neúčelovou částí***",null,null,null,null,null,null,null,null,null,null,null,null,null,null,null,null,"Výše účelové části v Kč",null,null,null,null,null,null,null,null,null,null,null,null,null,null,null,null,"Výše neúčelové části v Kč"]
[null,null,null,"Ano",null,null,null,"Ne"]
[]
[null,null,"PROHLÁŠENÍ ŽADATELE "]
[null,null,"Žadatel prohlašuje, že veškeré údaje uvedené v této žádosti o poskytnutí úvěru, resp. v dokumentech přiložených, jsou úplné a odpovídají skutečnosti a že nezamlčel žádnou relevantní skutečnost, která by mohla ovlivnit rozhodnutí UniCredit Bank Czech Republic and Slovakia, a.s. (dále jen „Banka“) při poskytnutí úvěru. \n\n\n\n"]
[null,null,"Dále Žadatel prohlašuje, že je plně svéprávný a že ke dni podání této žádosti o poskytnutí úvěru není v prodlení vůči státu nebo jinému subjektu s úhradou daní či poplatků, úhradou pojistného na sociální zabezpečení, zdravotní pojištění, úhradou cla nebo jiných povinných plateb."]
[null,null,"Žadatel souhlasí s tím, aby Banka získala informace o jeho bonitě (zahrnující zejména informaci o povaze a rozsahu případného porušení dřívějších závazků), platební morálce a důvěryhodnosti, které jsou nutné k posouzení žádosti o poskytnutí úvěru, a to z registrů sdružení SOLUS (www.solus.cz), jehož je Banka členem.\n"]
[null,null,"Žadatel potvrzuje, že se seznámil s \"Poučením o zpracování osobních údajů podle § 11 zákona č. 101/2000 Sb., o ochraně osobních údajů\", které je k dispozici mj. na webových stránkách a pobočkách Banky, zejména výslovně bere na vědomí, že Banka může jeho osobní údaje zpracovávat i prostřednictvím zpracovatelů se sídlem v členských státech Evropské unie, zejm. UniCredit Business Integrated Solutions S.C.p.A., Itálie. Veškerá místa, na kterých dochází ke zpracování osobních údajů Bankou nebo zpracovateli Banky, jsou nahlášena jako místa zpracování osobních údajů u Úřadu pro ochranu osobních údajů."]
[]
[]
[]
[null,null,"Místo, datum",null,null,null,null,null,null,null,null,null,null,null,null,null,null,null,null,null,null,null,null,null,null,null,null,"Podpis Žadatele"]
[null,null,"* Nehodící se škrtněte"]
[null,null,"** Včetně všech nákladů, které budou z úvěru hrazeny (životní pojištění, poplatky atd.)"]
[null,null,"*** Hypoteční úvěr Twin (rezidenční hypoteční úvěr kombinovaný s neúčelovou částí)"]
[null,null,"Vyplní Banka / Pověřený zástupce Banky / Třetí strana - rozdělit"]
[null,null,"Totožnost ověřil (jméno, příjmení):",null,null,null,null,null,null,null,null,null,null,null,null,null,null,null,null,null,null,null,null,null,null,null,null,"Dne:",null,null,null,null,null,null,null,null,null,null,null,null,"Podpis:"]
[]
[null,null,"Název (jméno) 3P:",null,null,null,null,null,null,null,null,null,null,null,null,null,null,null,null,null,null,null,null,null,null,null,null,"Jméno a příjmení makléře:"]
[]
[null,null,"Přidělené ID 3P:",null,null,null,null,null,null,null,null,null,null,null,null,null,null,null,null,null,null,null,null,null,null,null,null,"IČ (popř. RČ) makléře",null,null,null,null,null,null,null,null,null,null,null,null,"Evid. č. makléře"]
[]
[null,null,"Telefon makléře:",null,null,null,null,null,null,null,null,null,null,null,null,null,null,null,null,null,null,null,null,null,null,null,null,"E-mail makléře:"]
[]
[]
[]
[null,"SOUHLAS se zpracováním osobních údajů a použitím rodného čísla"]
[null,"V souvislosti s uzavřením/žádostí o uzavření smlouvy mezi mnou a UniCredit Bank Czech Republic and Slovakia, a.s. (dále jen „Smlouva“ a „Banka“) souhlasím s tím, aby Banka za níže uvedeným účelem shromažďovala, zpracovávala a uchovávala mé osobní údaje, tj. jméno, příjmení, datum narození, rodné číslo, adresu, údaje o identifikačním dokladu a IČ (dále jen „osobní údaje“), a to způsobem, a za podmínek uvedených v Informačním Memorandu Bankovního registru klientských informací a Nebankovního registru klientských informací (dále jen „Informační Memorandum“) a v Poučení o registrech Sdružení SOLUS (též jen „Poučení“)."]
[null,"Dále souhlasím, aby Banka mé osobní údaje předávala Sdružení SOLUS k dalšímu zpracování v „Pozitivním registru sdružení SOLUS“ (též jen „Pozitivní registr“) a v Registru FO Sdružení SOLUS (též jen „Registr FO“) k dalšímu shromažďování, zpracovávání a uchovávání. Souhlasím, aby Sdružení SOLUS vytvořilo informační soubor mých osobních údajů od všech členských bank, případně též společně s dalšími mými veřejně dostupnými osobními údaji (např. mé osobní údaje obsažené v Insolvenčním rejstříku), a v rámci tohoto informačního souboru mých osobních údajů provádělo statistická vyhodnocení mé bonity a důvěryhodnosti. Souhlasím, aby Sdružení SOLUS mé osobní údaje (ve formě informačního souboru včetně údajů o statistických vyhodnoceních mé bonity a důvěryhodnosti) zpřístupnilo formou on-line dotazů všem oprávněným uživatelům (členům sdružení SOLUS) Pozitivního registru a Registru FO, tedy i Bance, a to vždy v rozsahu a za podmínek uvedeném pro každý z těchto registrů v Poučení."]
[null,"Souhlasím, aby Banka i opakovaně získávala informace o mé bonitě, platební morálce a důvěryhodnosti z Pozitivního registru a Registru FO. Souhlasím, aby všichni oprávnění uživatelé Pozitivního registru anebo Registru FO, kterým byly zpřístupněny mé osobní údaje, tyto používali, a to případně spolu s dalšími mými osobními údaji, jež oprávněně zpracovávají."]
[null,"Účelem zpracování osobních údajů v Pozitivním registru a Registru FO je splnění povinnosti odpovědného poskytování úvěrů a jiných obchodů Banky, zajištění vzájemného informování oprávněných uživatelů Pozitivního registru a Registru FO o mé bonitě, důvěryhodnosti a platební morálce, posuzování mé bonity, důvěryhodnosti a platební morálky ze strany oprávněných uživatelů Pozitivního registru a Registru FO, a to i opakovaně, jakož i ochrana práv Banky a ostatních členů sdružení SOLUS. Kromě předešlého je účelem zpracování mých osobních údajů na základě tohoto souhlasu rovněž zajištění vzájemného informování oprávněných uživatelů Bankovního registru klientských informací (dále jen „BRKI“) a Nebankovního registru klientských informací (dále jen „NRKI“) o mé bonitě, důvěryhodnosti a platební morálce a umožnění (a to i opakovaného) posuzování mé bonity, důvěryhodnosti a platební morálky ze strany oprávněných uživatelů BRKI a NRKI. Způsob, rozsah a podmínky vzájemného informování oprávněných uživatelů BRKI a NRKI jsou uvedeny v Informačním Memorandu."]
[null,"Souhlas uděluji na dobu 4 let ode dne jeho udělení. V případě, že mezi mnou [nebo žadatelem, pokud jde o ručitele, spolužadatele nebo zákonného zástupce] a Bankou byla nebo bude uzavřena Smlouva, uděluji tento souhlas na dobu jejího trvání a na dobu dalších 4 let od splnění veškerých mých finančních závazků z uzavřené Smlouvy, pokud tyto závazky zaniknou splněním nebo způsobem nahrazujícím splnění, resp. od zániku Smlouvy, pokud finanční závazky ze Smlouvy zaniknou jinak. "]
[null,"Před podpisem tohoto souhlasu jsem se seznámil(a) s Informačním Memorandem, které obsahuje i poučení o mých právech v souvislosti se zpracováním mých osobních údajů v rámci BRKI i pro účely vzájemného informování se uživatelů BRKI a/nebo NRKI o bonitě, důvěryhodnosti či platební morálce jejich klientů. Před podpisem tohoto souhlasu jsem rovněž byl(a) informován(a), že aktuální znění Informačního Memoranda mohu kdykoli získat na informační lince, pobočkách a na webových stránkách banky www.unicreditbank.cz nebo na informační lince a webových stránkách provozovatele registru www.cbcb.cz."]
[null,"Dále prohlašuji, že jsem se seznámil(a) s  dokumentem \"POUČENÍ o registrech Sdružení SOLUS\", jehož obsahem je: (i) vysvětlení pojmu informační soubor, a to zvlášť pro Pozitivní registr a Registr FO, (ii) definice dalších mých osobních údajů, které mohou vzniknout při zpracování, (iii) popis fungování Pozitivního registru a Registru FO, (iv) identifikace subjektů či osob, které mohou mít přístup k mým osobním údajům při jejich zpracování  a (v) poučení o mých právech (§ 11 a § 12 zákona o ochraně osobních údajů č. 101/2000 Sb.) a nárocích (§ 21 zákona č. 101/2000 Sb.) v souvislosti se zpracováním mých osobních údajů v rámci pozitivního registru SOLUS. Byl(a) jsem informován(a), že aktuální znění Poučení mohu kdykoli získat na informační lince, pobočkách a webových stránkách banky www.unicreditbank.cz nebo na informační lince a webových stránkách sdružení SOLUS www.solus.cz."]
[null,"Potvrzuji, že jsem byl(a) Bankou poučen(a) o svých nárocích vůči porušiteli dle § 21 zákona č. 101/2000 Sb. "]
[null,"Po uzavření Smlouvy s Bankou se tento souhlas stává její nedílnou součástí."]
[]
[null,"V",null,null,null,null,null,null,null,null,null,null,null,null,null,null,null,null,null,"dne"]
[]
[]
[]
[null,"Podpis žadatele"]
[]
[]
[]
[null,"Podpis spolužadatele"]
[]
[null,"Jméno a podpis zástupce banky, který podpis/y ověřil:"]
[null,null,"Vyplní Banka"]
[null,null,"Pracovník banky:",null,null,null,null,null,null,null,null,null,null,null,null,null,null,null,null,null,null,null,null,null,"Číslo klienta (NDG):"]
[null,null,"Pobočka (číslo):",null,null,null,null,null,null,null,null,null,null,null,null,null,null,null,null,null,null,null,null,null,"Číslo žádosti:"]
[]
[null,"ŽÁDOST O POSKYTNUTÍ HYPOTEČNÍHO ÚVĚRU"]
[null,null,"Vyplní klient"]
[null,null,"ÚDAJE O ŽADATELI/SPOLUŽADATELI* (DÁLE JEN \"ŽADATEL\")"]
[null,null,"Základní údaje"]
[null,null,"Jméno",null,null,null,null,null,null,null,null,null,null,null,null,null,null,null,null,"Příjmení",null,null,null,null,null,null,null,null,null,null,null,null,null,null,null,null,"Rodné číslo"]
[]
[null,null,"Datum narození",null,null,null,null,null,null,null,null,null,null,null,null,null,null,null,null,"Země narození (není-li ČR)",null,null,null,null,null,null,null,null,null,null,null,null,null,null,null,null,"Pohlaví"]
[null,null,null,null,null,null,null,null,null,null,null,null,null,null,null,null,null,null,null,null,null,null,null,null,null,null,null,null,null,null,null,null,null,null,null,null,null,"Muž",null,null,"Žena"]
[null,null,"Adresa trvalého pobytu (ulice, č.p., město, PSČ, země)"]
[]
[null,null,"Doklad totožnosti"]
[null,null,"Typ dokladu"]
[null,null,null,"Občanský průkaz",null,null,null,null,null,null,"Cestovní pas",null,null,null,null,null,"Identifikační karta občana EU"]
[null,null,"Číslo dokladu",null,null,null,null,null,null,null,null,null,null,null,null,null,null,null,null,"Země vydání dokladu (není-li ČR)",null,null,null,null,null,null,null,null,null,null,null,null,null,null,null,null,"Datum vydání dokladu"]
[]
[null,null,"Kontaktní údaje"]
[null,null,"Telefon",null,null,null,null,null,null,null,null,null,null,null,null,null,null,null,null,"E-mail"]
[]
[]
[null,null,"ÚDAJE O POŽADOVANÉM  ÚVĚRU"]
[null,null,"Účel úvěru refinancování",null,null,null,null,null,null,null,null,null,null,null,null,null,null,null,null,"Celková výše úvěru v Kč**",null,null,null,null,null,null,null,null,null,null,null,null,null,null,null,null,"Počet splátek"]
[null,null,null,"Ano",null,null,null,"Ne"]
[null,null,"Úvěr v kombinaci s neúčelovou částí***",null,null,null,null,null,null,null,null,null,null,null,null,null,null,null,null,"Výše účelové části v Kč",null,null,null,null,null,null,null,null,null,null,null,null,null,null,null,null,"Výše neúčelové části v Kč"]
[null,null,null,"Ano",null,null,null,"Ne"]
[]
[null,null,"PROHLÁŠENÍ ŽADATELE "]
[null,null,"Žadatel prohlašuje, že veškeré údaje uvedené v této žádosti o poskytnutí úvěru, resp. v dokumentech přiložených, jsou úplné a odpovídají skutečnosti a že nezamlčel žádnou relevantní skutečnost, která by mohla ovlivnit rozhodnutí UniCredit Bank Czech Republic and Slovakia, a.s. (dále jen „Banka“) při poskytnutí úvěru. \n\n\n\n"]
[null,null,"Dále Žadatel prohlašuje, že je plně svéprávný a že ke dni podání této žádosti o poskytnutí úvěru není v prodlení vůči státu nebo jinému subjektu s úhradou daní či poplatků, úhradou pojistného na sociální zabezpečení, zdravotní pojištění, úhradou cla nebo jiných povinných plateb."]
[null,null,"Žadatel souhlasí s tím, aby Banka získala informace o jeho bonitě (zahrnující zejména informaci o povaze a rozsahu případného porušení dřívějších závazků), platební morálce a důvěryhodnosti, které jsou nutné k posouzení žádosti o poskytnutí úvěru, a to z registrů sdružení SOLUS (www.solus.cz), jehož je Banka členem.\n"]
[null,null,"Žadatel potvrzuje, že se seznámil s \"Poučením o zpracování osobních údajů podle § 11 zákona č. 101/2000 Sb., o ochraně osobních údajů\", které je k dispozici mj. na webových stránkách a pobočkách Banky, zejména výslovně bere na vědomí, že Banka může jeho osobní údaje zpracovávat i prostřednictvím zpracovatelů se sídlem v členských státech Evropské unie, zejm. UniCredit Business Integrated Solutions S.C.p.A., Itálie. Veškerá místa, na kterých dochází ke zpracování osobních údajů Bankou nebo zpracovateli Banky, jsou nahlášena jako místa zpracování osobních údajů u Úřadu pro ochranu osobních údajů."]
[]
[]
[]
[null,null,"Místo, datum",null,null,null,null,null,null,null,null,null,null,null,null,null,null,null,null,null,null,null,null,null,null,null,null,"Podpis Žadatele"]
[null,null,"* Nehodící se škrtněte"]
[null,null,"** Včetně všech nákladů, které budou z úvěru hrazeny (životní pojištění, poplatky atd.)"]
[null,null,"*** Hypoteční úvěr Twin (rezidenční hypoteční úvěr kombinovaný s neúčelovou částí)"]
[null,null,"Vyplní Banka / Pověřený zástupce Banky / Třetí strana - rozdělit"]
[null,null,"Totožnost ověřil (jméno, příjmení):",null,null,null,null,null,null,null,null,null,null,null,null,null,null,null,null,null,null,null,null,null,null,null,null,"Dne:",null,null,null,null,null,null,null,null,null,null,null,null,"Podpis:"]
[]
[null,null,"Název (jméno) 3P:",null,null,null,null,null,null,null,null,null,null,null,null,null,null,null,null,null,null,null,null,null,null,null,null,"Jméno a příjmení makléře:"]
[]
[null,null,"Přidělené ID 3P:",null,null,null,null,null,null,null,null,null,null,null,null,null,null,null,null,null,null,null,null,null,null,null,null,"IČ (popř. RČ) makléře",null,null,null,null,null,null,null,null,null,null,null,null,"Evid. č. makléře"]
[]
[null,null,"Telefon makléře:",null,null,null,null,null,null,null,null,null,null,null,null,null,null,null,null,null,null,null,null,null,null,null,null,"E-mail makléře:"]
[]
[]
[]
[null,"SOUHLAS se zpracováním osobních údajů a použitím rodného čísla"]
[null,"V souvislosti s uzavřením/žádostí o uzavření smlouvy mezi mnou a UniCredit Bank Czech Republic and Slovakia, a.s. (dále jen „Smlouva“ a „Banka“) souhlasím s tím, aby Banka za níže uvedeným účelem shromažďovala, zpracovávala a uchovávala mé osobní údaje, tj. jméno, příjmení, datum narození, rodné číslo, adresu, údaje o identifikačním dokladu a IČ (dále jen „osobní údaje“), a to způsobem, a za podmínek uvedených v Informačním Memorandu Bankovního registru klientských informací a Nebankovního registru klientských informací (dále jen „Informační Memorandum“) a v Poučení o registrech Sdružení SOLUS (též jen „Poučení“)."]
[null,"Dále souhlasím, aby Banka mé osobní údaje předávala Sdružení SOLUS k dalšímu zpracování v „Pozitivním registru sdružení SOLUS“ (též jen „Pozitivní registr“) a v Registru FO Sdružení SOLUS (též jen „Registr FO“) k dalšímu shromažďování, zpracovávání a uchovávání. Souhlasím, aby Sdružení SOLUS vytvořilo informační soubor mých osobních údajů od všech členských bank, případně též společně s dalšími mými veřejně dostupnými osobními údaji (např. mé osobní údaje obsažené v Insolvenčním rejstříku), a v rámci tohoto informačního souboru mých osobních údajů provádělo statistická vyhodnocení mé bonity a důvěryhodnosti. Souhlasím, aby Sdružení SOLUS mé osobní údaje (ve formě informačního souboru včetně údajů o statistických vyhodnoceních mé bonity a důvěryhodnosti) zpřístupnilo formou on-line dotazů všem oprávněným uživatelům (členům sdružení SOLUS) Pozitivního registru a Registru FO, tedy i Bance, a to vždy v rozsahu a za podmínek uvedeném pro každý z těchto registrů v Poučení."]
[null,"Souhlasím, aby Banka i opakovaně získávala informace o mé bonitě, platební morálce a důvěryhodnosti z Pozitivního registru a Registru FO. Souhlasím, aby všichni oprávnění uživatelé Pozitivního registru anebo Registru FO, kterým byly zpřístupněny mé osobní údaje, tyto používali, a to případně spolu s dalšími mými osobními údaji, jež oprávněně zpracovávají."]
[null,"Účelem zpracování osobních údajů v Pozitivním registru a Registru FO je splnění povinnosti odpovědného poskytování úvěrů a jiných obchodů Banky, zajištění vzájemného informování oprávněných uživatelů Pozitivního registru a Registru FO o mé bonitě, důvěryhodnosti a platební morálce, posuzování mé bonity, důvěryhodnosti a platební morálky ze strany oprávněných uživatelů Pozitivního registru a Registru FO, a to i opakovaně, jakož i ochrana práv Banky a ostatních členů sdružení SOLUS. Kromě předešlého je účelem zpracování mých osobních údajů na základě tohoto souhlasu rovněž zajištění vzájemného informování oprávněných uživatelů Bankovního registru klientských informací (dále jen „BRKI“) a Nebankovního registru klientských informací (dále jen „NRKI“) o mé bonitě, důvěryhodnosti a platební morálce a umožnění (a to i opakovaného) posuzování mé bonity, důvěryhodnosti a platební morálky ze strany oprávněných uživatelů BRKI a NRKI. Způsob, rozsah a podmínky vzájemného informování oprávněných uživatelů BRKI a NRKI jsou uvedeny v Informačním Memorandu."]
[null,"Souhlas uděluji na dobu 4 let ode dne jeho udělení. V případě, že mezi mnou [nebo žadatelem, pokud jde o ručitele, spolužadatele nebo zákonného zástupce] a Bankou byla nebo bude uzavřena Smlouva, uděluji tento souhlas na dobu jejího trvání a na dobu dalších 4 let od splnění veškerých mých finančních závazků z uzavřené Smlouvy, pokud tyto závazky zaniknou splněním nebo způsobem nahrazujícím splnění, resp. od zániku Smlouvy, pokud finanční závazky ze Smlouvy zaniknou jinak. "]
[null,"Před podpisem tohoto souhlasu jsem se seznámil(a) s Informačním Memorandem, které obsahuje i poučení o mých právech v souvislosti se zpracováním mých osobních údajů v rámci BRKI i pro účely vzájemného informování se uživatelů BRKI a/nebo NRKI o bonitě, důvěryhodnosti či platební morálce jejich klientů. Před podpisem tohoto souhlasu jsem rovněž byl(a) informován(a), že aktuální znění Informačního Memoranda mohu kdykoli získat na informační lince, pobočkách a na webových stránkách banky www.unicreditbank.cz nebo na informační lince a webových stránkách provozovatele registru www.cbcb.cz."]
[null,"Dále prohlašuji, že jsem se seznámil(a) s  dokumentem \"POUČENÍ o registrech Sdružení SOLUS\", jehož obsahem je: (i) vysvětlení pojmu informační soubor, a to zvlášť pro Pozitivní registr a Registr FO, (ii) definice dalších mých osobních údajů, které mohou vzniknout při zpracování, (iii) popis fungování Pozitivního registru a Registru FO, (iv) identifikace subjektů či osob, které mohou mít přístup k mým osobním údajům při jejich zpracování  a (v) poučení o mých právech (§ 11 a § 12 zákona o ochraně osobních údajů č. 101/2000 Sb.) a nárocích (§ 21 zákona č. 101/2000 Sb.) v souvislosti se zpracováním mých osobních údajů v rámci pozitivního registru SOLUS. Byl(a) jsem informován(a), že aktuální znění Poučení mohu kdykoli získat na informační lince, pobočkách a webových stránkách banky www.unicreditbank.cz nebo na informační lince a webových stránkách sdružení SOLUS www.solus.cz."]
[null,"Potvrzuji, že jsem byl(a) Bankou poučen(a) o svých nárocích vůči porušiteli dle § 21 zákona č. 101/2000 Sb. "]
[null,"Po uzavření Smlouvy s Bankou se tento souhlas stává její nedílnou součástí."]
[]
[null,"V",null,null,null,null,null,null,null,null,null,null,null,null,null,null,null,null,null,"dne"]
[]
[]
[]
[null,"Podpis žadatele"]
[]
[]
[]
[null,"Podpis spolužadatele"]
[]
[null,"Jméno a podpis zástupce banky, který podpis/y ověřil:"]
[null,null,"Vyplní Banka",null,null,null,null,null,null,null,null,null,null,null,null,null,null,null,null,null,null,null,null,null,null,null,null,"Datum převzetí KOMPLETNÍ dokumentace "]
[null,null,"Pracovník banky:"]
[null,null,"Pobočka (číslo):"]
[null,null,"NDG klientů:"]
[null,null,null,null,null,null,null,null,null,null,null,null,null,null,null,null,null,null,null,null,null,null,null,null,null,null,null,"razítko \"Doručeno dne\""]
[]
[null,"DOPLŇUJÍCÍ INFORMACE K ŽÁDOSTI O POSKYTNUTÍ HYPOTEČNÍHO ÚVĚRU"]
[null,null,"Vyplní klient"]
[null,null,"ŽADATEL",null,null,null,null,null,null,null,null,null,null,null,null,null,null,null,null,null,null,null,null,null,null,null,null,null,"SPOLUŽADATEL"]
[null,null,"Titul před jménem",null,null,null,null,null,null,null,null,null,null,"Titul za jménem",null,null,null,null,null,null,null,null,null,null,null,null,null,null,"Titul před jménem",null,null,null,null,null,null,null,null,null,null,"Titul za jménem"]
[]
[null,null,"Jméno",null,null,null,null,null,null,null,null,null,null,null,null,null,null,null,null,null,null,null,null,null,null,null,null,null,"Jméno"]
[]
[null,null,"Příjmení",null,null,null,null,null,null,null,null,null,null,null,null,null,null,null,null,null,null,null,null,null,null,null,null,null,"Příjmení"]
[]
[null,null,"Rodné číslo / u cizinců datum narození",null,null,null,null,null,null,null,null,null,null,null,null,null,null,null,null,null,null,null,null,null,null,null,null,null,"Rodné číslo / u cizinců datum narození"]
[]
[null,null,"Státní příslušnost",null,null,null,null,null,null,null,null,null,null,null,null,null,null,null,null,null,null,null,null,null,null,null,null,null,"Státní příslušnost"]
[]
[null,null,"Rodinný stav",null,null,null,null,null,null,null,null,null,null,null,null,"Vzdělání",null,null,null,null,null,null,null,null,null,null,null,null,"Rodinný stav",null,null,null,null,null,null,null,null,null,null,null,null,"Vzdělání"]
[null,null,null," Svobodný/svobodná",null,null,null,null,null,null,null,null,null,null,null,null,"VŠ",null,null,null,null,null,null,null,null,null,null,null,null," Svobodný/svobodná",null,null,null,null,null,null,null,null,null,null,null,null,"VŠ"]
[]
[null,null,null," Ženatý/vdaná",null,null,null,null,null,null,null,null,null,null,null,null,"Vyšší odborné",null,null,null,null,null,null,null,null,null,null,null,null," Ženatý/vdaná",null,null,null,null,null,null,null,null,null,null,null,null,"Vyšší odborné"]
[]
[null,null,null,null,"SJM zúženo",null,null,null,null,null,null,null,null,null,null,null,"SŠ s maturitou",null,null,null,null,null,null,null,null,null,null,null,null,null,"SJM zúženo",null,null,null,null,null,null,null,null,null,null,null,"SŠ s maturitou"]
[]
[null,null,null,null,"oddělená jmění",null,null,null,null,null,null,null,null,null,null,null,"OU s maturitou",null,null,null,null,null,null,null,null,null,null,null,null,null,"oddělená jmění",null,null,null,null,null,null,null,null,null,null,null,"OU s maturitou"]
[]
[null,null,null," Rozvedený/rozvedená",null,null,null,null,null,null,null,null,null,null,null,null,"OU",null,null,null,null,null,null,null,null,null,null,null,null," Rozvedený/rozvedená",null,null,null,null,null,null,null,null,null,null,null,null,"OU"]
[]
[null,null,null,null,"méně než 3 let",null,null,null,null,null,null,null,null,null,null,null,"Základní",null,null,null,null,null,null,null,null,null,null,null,null,null,"méně než 3 let",null,null,null,null,null,null,null,null,null,null,null,"Základní"]
[]
[null,null,null,null,"více než 3 let",null,null,null,null,null,null,null,null,null,null,null,null,null,null,null,null,null,null,null,null,null,null,null,null,null,"více než 3 let"]
[]
[null,null,null," Vdovec/vdova",null,null,null,null,null,null,null,null,null,null,null,null,null,null,null,null,null,null,null,null,null,null,null,null,null," Vdovec/vdova"]
[]
[null,null,null," Registrovaný partner",null,null,null,null,null,null,null,null,null,null,null,null,null,null,null,null,null,null,null,null,null,null,null,null,null," Registrovaný partner"]
[null,null,"Zvláštní vztah k UniCredit Bank Czech Republic and Slovakia, a.s. podle zákona o bankách 1)",null,null,null,null,null,null,null,null,null,null,null,null,null,null,null,null,null,null,null,null,null,null,null,null,null,"Zvláštní vztah k UniCredit Bank Czech Republic and Slovakia, a.s. podle zákona o bankách 1)"]
[null,null,null,"Ano",null,null,"Ne",null,null,null,null,null,null,null,null,null,null,null,null,null,null,null,null,null,null,null,null,null,null,"Ano",null,null,"Ne"]
[]
[null,null,null,null,null,null,null,null,null,null,null,"Jaký je vztah žadatele a spolužadatele?"]
[null,null,"Bytové poměry",null,null,null,null,null,null,null,null,null,null,null,null,null,null,null,null,null,null,null,null,null,null,null,null,null,"Bytové poměry"]
[null,null,null,"Vlastnictví domu/bytu",null,null,null,null,null,null,null,null,null,"Nájem",null,null,null,null,null,"Bydlení s rodiči",null,null,null,null,null,null,null,null,null,"Vlastnictví domu/bytu",null,null,null,null,null,null,null,null,null,"Nájem",null,null,null,null,null,"Bydlení s rodiči"]
[]
[null,null,null,"Právo k užívání družstevního domu/bytu",null,null,null,null,null,null,null,null,null,null,null,null,null,null,null,"Jiné",null,null,null,null,null,null,null,null,null,"Právo k užívání družstevního domu/bytu",null,null,null,null,null,null,null,null,null,null,null,null,null,null,null,"Jiné"]
[null,null,"Bydliště (adresa skutečného pobytu, je-li odlišná od trvalého pobytu)",null,null,null,null,null,null,null,null,null,null,null,null,null,null,null,null,null,null,null,null,null,null,null,null,null,"Bydliště (adresa skutečného pobytu, je-li odlišná od trvalého pobytu)"]
[]
[null,null,"Délka skutečného pobytu (v letech)",null,null,null,null,null,null,null,null,null,null,null,null,"Korespondenční adresa",null,null,null,null,null,null,null,null,null,null,null,null,"Délka skutečného pobytu (v letech)",null,null,null,null,null,null,null,null,null,null,null,null,"Korespondenční adresa"]
[null,null,null,null,null,null,null,null,null,null,null,null,null,null,null,null,"Adresa trvalého pobytu",null,null,null,null,"Adresa bydliště",null,null,null,null,null,null,null,null,null,null,null,null,null,null,null,null,null,null,null,null,"Adresa trvalého pobytu",null,null,null,null,"Adresa bydliště"]
[]
[null,null,"Cizí státní příslušník ",null,null,null,null,null,null,null,null,null,null,null,null,null,null,null,null,null,null,null,null,null,null,null,null,null,"Cizí státní příslušník "]
[null,null,null,"Délka pobytu v ČR (v letech)",null,null,null,null,null,null,null,null,null,null,null,"Pobyt v ČR",null,null,null,null,null,null,null,null,null,null,null,null,null,"Délka pobytu v ČR (v letech)",null,null,null,null,null,null,null,null,null,null,null,"Pobyt v ČR"]
[null,null,null,null,null,null,null,null,null,null,null,null,null,null,null,null,"Trvalý",null,null,null,null,"Přechodný",null,null,null,null,null,null,null,null,null,null,null,null,null,null,null,null,null,null,null,null,"Trvalý",null,null,null,null,"Přechodný"]
[]
[]
[null,null,"Zaměstnavatel",null,null,null,null,null,null,null,null,null,null,null,null,null,null,null,null,null,null,null,null,null,null,null,null,null,"Zaměstnavatel"]
[null,null,"IČ",null,null,null,null,null,null,null,null,null,null,null,null,null,null,null,null,null,null,null,null,null,null,null,null,null,"IČ"]
[null,null,"Pracovní pozice",null,null,null,null,null,null,null,null,null,null,null,null,null,null,null,null,null,null,null,null,null,null,null,null,null,"Pracovní pozice"]
[]
[null,null,"Hlavní zdroj příjmu 2)",null,null,null,null,null,null,null,null,null,null,null,null,null,null,null,null,null,null,null,null,null,null,null,null,null,"Hlavní zdroj příjmu"]
[null,null,null,null,"závislá činnost",null,null,null,null,null,null,null,null,null,null,null,null,"v ČR",null,null,"v zahraničí",null,null,null,null,null,null,null,null,null,"závislá činnost",null,null,null,null,null,null,null,null,null,null,null,null,"v ČR",null,null,"v zahraničí"]
[]
[null,null,null,null,null,null,null,null,null,null,null,null,null,null,null,null,{"$f":"radek31","v":0},null,null,null,null,null,null,null,"Kč",null,null,null,null,null,null,null,null,null,null,null,null,null,null,null,null,null,null,null,null,null,null,null,null,null,"Kč"]
[null,null,null,null,null,"délka současného prac. poměru",null,null,null,null,null,null,null,null,null,null,null,null,null,null,null,"v letech",null,null,null,null,null,null,null,null,null,"délka současného prac. poměru",null,null,null,null,null,null,null,null,null,null,null,null,null,null,null,"v letech"]
[null,null,null,null,null,"délka předchozího prac. poměru",null,null,null,null,null,null,null,null,null,null,null,null,null,null,null,"v letech",null,null,null,null,null,null,null,null,null,"délka předchozího prac. poměru",null,null,null,null,null,null,null,null,null,null,null,null,null,null,null,"v letech"]
[]
[null,null,null,null,null,"zkušební / výpovědní doba 3)",null,null,null,null,null,null,null,null,null,null,null,"Ano",null,null,"Ne",null,null,null,null,null,null,null,null,null,null,"zkušební / výpovědní doba 3)",null,null,null,null,null,null,null,null,null,null,null,"Ano",null,null,"Ne"]
[]
[null,null,null,null,"samostatně výdělečná činnost",null,null,null,null,null,null,null,null,null,null,null,{"$f":"radek37","v":0},null,null,null,null,null,null,null,"Kč",null,null,null,null,null,"samostatně výdělečná činnost",null,null,null,null,null,null,null,null,null,null,null,null,null,null,null,null,null,null,null,"Kč"]
[]
[null,null,null,null,null,"aktivní nepřetržitě min. 12 měsíců",null,null,null,null,null,null,null,null,null,null,null,"Ano",null,null,"Ne",null,null,null,null,null,null,null,null,null,null,"aktivní nepřetržitě min. 12 měsíců",null,null,null,null,null,null,null,null,null,null,null,"Ano",null,null,"Ne"]
[]
[null,null,null,null,"příjem z pronájmu",null,null,null,null,null,null,null,null,null,null,null,{"$f":"radek38","v":0},null,null,null,null,null,null,null,"Kč",null,null,null,null,null,"příjem z pronájmu",null,null,null,null,null,null,null,null,null,null,null,null,null,null,null,null,null,null,null,"Kč"]
[]
[null,null,null,null,"příjem z kapitálového majetku",null,null,null,null,null,null,null,null,null,null,null,{"$f":"radek39","v":0},null,null,null,null,null,null,null,"Kč",null,null,null,null,null,"příjem z kapitálového majetku",null,null,null,null,null,null,null,null,null,null,null,null,null,null,null,null,null,null,null,"Kč"]
[]
[null,null,null,null,"starobní důchod",null,null,null,null,null,null,null,null,null,null,null,null,null,null,null,null,null,null,null,"Kč",null,null,null,null,null,"starobní důchod",null,null,null,null,null,null,null,null,null,null,null,null,null,null,null,null,null,null,null,"Kč"]
[]
[null,null,null,null,"jiný",null,null,null,null,null,null,null,null,null,null,null,null,null,null,null,null,null,null,null,"Kč",null,null,null,null,null,"jiný",null,null,null,null,null,null,null,null,null,null,null,null,null,null,null,null,null,null,null,"Kč"]
[]
[null,null,"Počet dospělých  v domácnosti včetně dětí ve věku 15-26",null,null,null,null,null,null,null,null,null,null,null,"Počet dětí v domácnosti (do 15 let)",null,null,null,null,null,null,null,null,null,null,null,null,null,"Počet dospělých  v domácnosti",null,null,null,null,null,null,null,null,null,null,null,"Počet dětí v domácnosti (do 26 let)"]
[]
[]
[null,null,null,null,null,null,null,null,null,null,null,null,null,null,"jako spolu/žadatel",null,null,null,null,null,null,"jako ručitel",null,null,null,null,null,null,null,null,null,null,null,null,null,null,null,null,null,null,"jako spolu/žadatel",null,null,null,null,null,null,"jako ručitel"]
[null,null,"Hypoteční úvěr, úvěr ze stavebního spoření",null,null,null,null,null,null,null,null,null,null,null,null,null,null,null,null,null,null,null,null,null,null,null,null,null,"Hypoteční úvěr, úvěr ze stavebního spoření"]
[null,null,"Osobní úvěr, leasing, splátkový prodej, zápůjčka",null,null,null,null,null,null,null,null,null,null,null,null,null,null,null,null,null,null,null,null,null,null,null,null,null,"Osobní úvěr, leasing, splátkový prodej, zápůjčka"]
[null,null,"Kontokorentní úvěr (vč. nevyužívaných)",null,null,null,null,null,null,null,null,null,null,null,null,null,null,null,null,null,null,null,null,null,null,null,null,null,"Kontokorentní úvěr (vč. nevyužívaných)"]
[null,null,"Kreditní karta (vč. nevyužívaných)",null,null,null,null,null,null,null,null,null,null,null,null,null,null,null,null,null,null,null,null,null,null,null,null,null,"Kreditní karta (vč. nevyužívaných)"]
[null,null,"Další pravidelné výdaje (výživné, spoření, pojištění)",null,null,null,null,null,null,null,null,null,null,null,null,null,null,null,null,null,null,null,null,null,null,null,null,null,"Další pravidelné výdaje (výživné, spoření, pojištění)"]
[null,null,"Náklady na bydlení",null,null,null,null,null,null,null,null,null,null,null,null,null,null,null,null,null,null,null,null,null,null,null,null,null,"Náklady na bydlení"]
[]
[null,null,"SPECIFIKACE ÚVĚRU"]
[null,null,"Typ úrokové sazby",null,null,null,null,null,null,null,null,null,null,null,null,null,null,null,null,null,null,null,null,"Délka čerpání úvěru (v měsících) 6)",null,null,null,null,null,null,null,null,null,null,null,null,null,"Mám zájem o slevu na úrokové sazbě za:"]
[null,null,null,"Fixní - délka fixace úrokové sazby (v letech) 4)",null,null,null,null,null,null,null,null,null,null,null,null,null,null,null,null,null,null,null,null,null,null,null,null,null,null,null,null,null,null,null,null,null,null,"Pojištění schopnosti splácet 7)"]
[]
[null,null,null,"Variabilní (Převratná hypotéka) 5)",null,null,null,null,null,null,null,null,null,null,"Variabilní s garancí",null,null,null,null,null,null,null,null,null,null,null,null,null,null,null,null,null,null,null,null,null,null,null,"Aktivní běžný účet 8)"]
[]
[null,null,null,null,null,null,null,null,null,null,null,null,null,null,null,null,null,null,null,null,null,null,null,null,null,null,null,null,null,null,null,null,null,null,null,null,null,null,"Aktivní kreditní kartu 9)"]
[null,null,"Účel úvěru"]
[null,null,null,"Koupě ",null,null,null,null,null,null,null,null,null,null,null,null,null,null,null,null,null,null,null,null,null,null,null,null,null,"Typ úvěru"]
[]
[null,null,null,"Refinancování ",null,null,null,null,null,null,null,null,null,null,null,null,null,null,null,null,null,null,null,null,null,null,null,null,null,null,"INDIVIDUAL - Hypoteční úvěr účelový"]
[]
[null,null,null,"Výstavba / Rekonstrukce",null,null,null,null,null,null,null,null,null,null,null,null,null,null,null,null,null,null,null,null,null,null,null,null,null,null,"FLEXI - Hypoteční úvěr s možností předčasné splátky "]
[]
[null,null,null,"Vypořádání majetkových poměrů spojených s nemovitostí",null,null,null,null,null,null,null,null,null,null,null,null,null,null,null,null,null,null,null,null,null,null,null,null,null,null,"TWIN - Hypoteční úvěr s kombinací neúčelové části "]
[]
[null,null,null,"Zpětné proplacení finančních prostředků",null,null,null,null,null,null,null,null,null,null,null,null,null,null,null,null,null,null,null,null,null,null,null,null,null,null,"Hypoteční úvěr účelový nerezidenční"]
[]
[null,null,null,"Jiný ",null,null,null,null,null,null,null,null,null,null,null,null,null,null,null,null,null,null,null,null,null,null,null,null,null,null,"Hypoteční úvěr neúčelový"]
[]
[null,null,"1) Za osoby, které mají k bance zvláštní vztah, se podle § 19 zákona č. 21/1992 Sb., o bankách, považují a) členové statutárního orgánu a vedoucí zaměstnanci banky, b) členové dozorčí rady banky, c) právnické osoby mající kontrolu nad bankou, jejich hlavní akcionáři a členové vedení těchto společností, d) osoby blízké členům statutárního orgánu, dozorčí rady, vedoucím zaměstnancům banky a osobám majícím kontrolu nad bankou, e) právnické osoby, ve kterých některá z osob uvedených pod písmeny a), b) a c) má podíl na základním jmění přesahující 10 %, f) hlavní akcionáři banky a jakákoliv právnická osoba pod jejich kontrolou, g) členové bankovní rady České národní banky, h) právnické osoby, nad kterými má banka kontrolu."]
[null,null,"2) Výše čistého měsíčního příjmu za poslední 3 měsíce. U osoby samostatně výdělečně činné za posledních 12 kalendářních měsíců."]
[null,null,"3) Nehodící se škrtněte."]
[null,null,"4) Déka fixace úrokové sazby je počet let, po které bude fixní úroková sazba neměnná."]
[null,null,"5) Úroková sazba je složena z variabilní a fixní složky, tj. její celková výše se mění v závislosti na situaci na finančním trhu."]
[null,null,"6) Období čerpání (od podpisu smlouvy do ukončení čerpání)."]
[null,null,"7) Úvěrové životní pojištění s jednorázově splatným pojistným, délka pojištění je 5 let, pojištění pro případ úmrtí + pracovní neschopnosti / ztráty zaměstnání / invalidity III. stupně. "]
[null,null,"8) Platí i pro stávajícího klienta UniCredit Bank v případě, že již službu využívá."]
[null,null,"9) Rámec kreditní karty je schválen současně s úvěrem. Karta je poskytnuta za zvýhodněných podmínek. Sleva platí i pro již existující kreditní kartu."]
[null,null,"10) Podmínky objednání odhadu Vám budou sděleny pracovníkem Banky, resp. pověřeným zástupcem Banky."]
[]
[null,null,"FINANCOVANÁ NEMOVITOST 1)"]
[null,null,"Adresa nemovitosti"]
[null,null,"Číslo listu vlastnictví",null,null,null,null,null,null,null,null,null,null,null,null,null,null,null,null,null,null,null,null,null,null,null,null,null,null,"Výše investice do nemovitosti"]
[]
[null,null,"Účel využití objektu úvěru",null,null,null,null,null,null,null,null,null,null,null,"vlastní bydlení (event. bydlení osoby blízké)",null,null,null,null,null,null,null,null,null,null,null,null,null,null,null,"rekreace",null,null,null,null,null,"pronájem"]
[]
[null,null,"ZASTAVENÁ NEMOVITOST"]
[null,null,null,null,"je totožná s objektem úvěru - níže uvedené údaje nevyplňujte a přejděte rovnou k podpisu žadatele a spolužadatele"]
[]
[null,null,null,null,"je odlišná od objektu úvěru"]
[null,null,"Vlastník nemovitosti",null,null,null,null,null,null,null,null,null,null,null,"žadatel nebo spolužadatel",null,null,null,null,null,null,null,null,null,null,"osoba blízká",null,null,null,null,null,null,"jiná osoba"]
[]
[null,null,"Adresa nemovitosti"]
[]
[null,null,"Účel využití objektu úvěru",null,null,null,null,null,null,null,null,null,null,null,"vlastní bydlení (event. bydlení osoby blízké)",null,null,null,null,null,null,null,null,null,null,null,null,null,null,null,"rekreace",null,null,null,null,null,"pronájem"]
[]
[null,null,"PROHLÁŠENÍ ŽADATELE A SPOLUŽADATELE"]
[null,null,"Prohlašuji, že veškeré údaje uvedené v těchto doplňujících informacích k žádosti o hypoteční úvěr, resp. v dokumentech přiložených, jsou úplné a odpovídají skutečnosti a že jsem nezamlčel(a) žádnou relevantní skutečnost, která by mohla ovlivnit rozhodnutí banky při poskytnutí úvěru."]
[null,null,"Prohlašuji, že úkon učiněný žadatelem nebo spolužadatelem vůči UniCredit Bank Czech Republic and Slovakia, a.s. do uzavření smlouvy o úvěru je úkonem učiněným jménem všech, tj žadatele a všech spolužadatelů. UniCredit Bank Czech Republic and Slovakia, a.s.  není povinna zkoumat vzájemné nároky těchto žadatelů a nenese žádnou odpovědnost za případné neoprávněné zásahy žadatelů do svých vzájemných nároků."]
[null,null,"Dále prohlašuji, že jsem plně způsobilý(á)  k právním úkonům."]
[null,null,"Dále prohlašuji, že nejsem v prodlení vůči státu nebo jinému subjektu s úhradou daní či poplatků, úhradou pojistného na sociální zabezpečení, zdravotní pojištění, úhradou cla nebo jiných povinných plateb a zároveň prohlašuji, že nemám jiné závazky vůči fyzickým či právnickým osobám s výjimkou uvedených výše v těchto doplňujících informacích k žádosti o hypoteční úvěr."]
[]
[]
[]
[]
[null,null,null,null,null,null,null,null,null,null,null,null,null,null,null,null,null,null,null,null,null,null,null,null,null,null,null,null,"Podpis žadatele"]
[]
[]
[]
[]
[null,null,"Místo, datum",null,null,null,null,null,null,null,null,null,null,null,null,null,null,null,null,null,null,null,null,null,null,null,null,null,"Podpis spolužadatele"]
[null,null,"Vyplní Banka"]
[null,null,"Totožnost žadatele/spolužadatele ověřil (jméno, příjmení):",null,null,null,null,null,null,null,null,null,null,null,null,null,null,null,null,null,null,null,null,null,null,null,null,null,"Dle občanských průkazů č. "]
[]
[null,null,"Dne:",null,null,null,null,null,null,null,null,null,null,null,"Podpis:"]
[]
[]
[null,null,"1) V případě zjednodušeného procesu refinancování přejděte k podpisu žadatele a spolužadatele. Informace o nemovitostech nevyplňujte"]
[]
[null,null,"Vyplní Banka",null,null,null,null,null,null,null,null,null,null,null,null,null,null,null,null,null,null,null,null,null,null,null,null,"Datum převzetí KOMPLETNÍ dokumentace "]
[null,null,"Pracovník banky:"]
[null,null,"Pobočka (číslo):"]
[null,null,"NDG klientů:"]
[null,null,null,null,null,null,null,null,null,null,null,null,null,null,null,null,null,null,null,null,null,null,null,null,null,null,null,"razítko \"Doručeno dne\""]
[]
[null,"DOPLŇUJÍCÍ INFORMACE K ŽÁDOSTI O POSKYTNUTÍ HYPOTEČNÍHO ÚVĚRU"]
[null,null,"Vyplní klient"]
[null,null,"ŽADATEL",null,null,null,null,null,null,null,null,null,null,null,null,null,null,null,null,null,null,null,null,null,null,null,null,null,"SPOLUŽADATEL"]
[null,null,"Titul před jménem",null,null,null,null,null,null,null,null,null,null,"Titul za jménem",null,null,null,null,null,null,null,null,null,null,null,null,null,null,"Titul před jménem",null,null,null,null,null,null,null,null,null,null,"Titul za jménem"]
[]
[null,null,"Jméno",null,null,null,null,null,null,null,null,null,null,null,null,null,null,null,null,null,null,null,null,null,null,null,null,null,"Jméno"]
[]
[null,null,"Příjmení",null,null,null,null,null,null,null,null,null,null,null,null,null,null,null,null,null,null,null,null,null,null,null,null,null,"Příjmení"]
[]
[null,null,"Rodné číslo / u cizinců datum narození",null,null,null,null,null,null,null,null,null,null,null,null,null,null,null,null,null,null,null,null,null,null,null,null,null,"Rodné číslo / u cizinců datum narození"]
[]
[null,null,"Státní příslušnost",null,null,null,null,null,null,null,null,null,null,null,null,null,null,null,null,null,null,null,null,null,null,null,null,null,"Státní příslušnost"]
[]
[null,null,"Rodinný stav",null,null,null,null,null,null,null,null,null,null,null,null,"Vzdělání",null,null,null,null,null,null,null,null,null,null,null,null,"Rodinný stav",null,null,null,null,null,null,null,null,null,null,null,null,"Vzdělání"]
[null,null,null," Svobodný/svobodná",null,null,null,null,null,null,null,null,null,null,null,null,"VŠ",null,null,null,null,null,null,null,null,null,null,null,null," Svobodný/svobodná",null,null,null,null,null,null,null,null,null,null,null,null,"VŠ"]
[]
[null,null,null," Ženatý/vdaná",null,null,null,null,null,null,null,null,null,null,null,null,"Vyšší odborné",null,null,null,null,null,null,null,null,null,null,null,null," Ženatý/vdaná",null,null,null,null,null,null,null,null,null,null,null,null,"Vyšší odborné"]
[]
[null,null,null,null,"SJM zúženo",null,null,null,null,null,null,null,null,null,null,null,"SŠ s maturitou",null,null,null,null,null,null,null,null,null,null,null,null,null,"SJM zúženo",null,null,null,null,null,null,null,null,null,null,null,"SŠ s maturitou"]
[]
[null,null,null,null,"oddělená jmění",null,null,null,null,null,null,null,null,null,null,null,"OU s maturitou",null,null,null,null,null,null,null,null,null,null,null,null,null,"oddělená jmění",null,null,null,null,null,null,null,null,null,null,null,"OU s maturitou"]
[]
[null,null,null," Rozvedený/rozvedená",null,null,null,null,null,null,null,null,null,null,null,null,"OU",null,null,null,null,null,null,null,null,null,null,null,null," Rozvedený/rozvedená",null,null,null,null,null,null,null,null,null,null,null,null,"OU"]
[]
[null,null,null,null,"méně než 3 let",null,null,null,null,null,null,null,null,null,null,null,"Základní",null,null,null,null,null,null,null,null,null,null,null,null,null,"méně než 3 let",null,null,null,null,null,null,null,null,null,null,null,"Základní"]
[]
[null,null,null,null,"více než 3 let",null,null,null,null,null,null,null,null,null,null,null,null,null,null,null,null,null,null,null,null,null,null,null,null,null,"více než 3 let"]
[]
[null,null,null," Vdovec/vdova",null,null,null,null,null,null,null,null,null,null,null,null,null,null,null,null,null,null,null,null,null,null,null,null,null," Vdovec/vdova"]
[]
[null,null,null," Registrovaný partner",null,null,null,null,null,null,null,null,null,null,null,null,null,null,null,null,null,null,null,null,null,null,null,null,null," Registrovaný partner"]
[null,null,"Zvláštní vztah k UniCredit Bank Czech Republic and Slovakia, a.s. podle zákona o bankách 1)",null,null,null,null,null,null,null,null,null,null,null,null,null,null,null,null,null,null,null,null,null,null,null,null,null,"Zvláštní vztah k UniCredit Bank Czech Republic and Slovakia, a.s. podle zákona o bankách 1)"]
[null,null,null,"Ano",null,null,"Ne",null,null,null,null,null,null,null,null,null,null,null,null,null,null,null,null,null,null,null,null,null,null,"Ano",null,null,"Ne"]
[]
[null,null,null,null,null,null,null,null,null,null,null,"Jaký je vztah žadatele a spolužadatele?"]
[null,null,"Bytové poměry",null,null,null,null,null,null,null,null,null,null,null,null,null,null,null,null,null,null,null,null,null,null,null,null,null,"Bytové poměry"]
[null,null,null,"Vlastnictví domu/bytu",null,null,null,null,null,null,null,null,null,"Nájem",null,null,null,null,null,"Bydlení s rodiči",null,null,null,null,null,null,null,null,null,"Vlastnictví domu/bytu",null,null,null,null,null,null,null,null,null,"Nájem",null,null,null,null,null,"Bydlení s rodiči"]
[]
[null,null,null,"Právo k užívání družstevního domu/bytu",null,null,null,null,null,null,null,null,null,null,null,null,null,null,null,"Jiné",null,null,null,null,null,null,null,null,null,"Právo k užívání družstevního domu/bytu",null,null,null,null,null,null,null,null,null,null,null,null,null,null,null,"Jiné"]
[null,null,"Bydliště (adresa skutečného pobytu, je-li odlišná od trvalého pobytu)",null,null,null,null,null,null,null,null,null,null,null,null,null,null,null,null,null,null,null,null,null,null,null,null,null,"Bydliště (adresa skutečného pobytu, je-li odlišná od trvalého pobytu)"]
[]
[null,null,"Délka skutečného pobytu (v letech)",null,null,null,null,null,null,null,null,null,null,null,null,"Korespondenční adresa",null,null,null,null,null,null,null,null,null,null,null,null,"Délka skutečného pobytu (v letech)",null,null,null,null,null,null,null,null,null,null,null,null,"Korespondenční adresa"]
[null,null,null,null,null,null,null,null,null,null,null,null,null,null,null,null,"Adresa trvalého pobytu",null,null,null,null,"Adresa bydliště",null,null,null,null,null,null,null,null,null,null,null,null,null,null,null,null,null,null,null,null,"Adresa trvalého pobytu",null,null,null,null,"Adresa bydliště"]
[]
[null,null,"Cizí státní příslušník ",null,null,null,null,null,null,null,null,null,null,null,null,null,null,null,null,null,null,null,null,null,null,null,null,null,"Cizí státní příslušník "]
[null,null,null,"Délka pobytu v ČR (v letech)",null,null,null,null,null,null,null,null,null,null,null,"Pobyt v ČR",null,null,null,null,null,null,null,null,null,null,null,null,null,"Délka pobytu v ČR (v letech)",null,null,null,null,null,null,null,null,null,null,null,"Pobyt v ČR"]
[null,null,null,null,null,null,null,null,null,null,null,null,null,null,null,null,"Trvalý",null,null,null,null,"Přechodný",null,null,null,null,null,null,null,null,null,null,null,null,null,null,null,null,null,null,null,null,"Trvalý",null,null,null,null,"Přechodný"]
[]
[]
[null,null,"Zaměstnavatel",null,null,null,null,null,null,null,null,null,null,null,null,null,null,null,null,null,null,null,null,null,null,null,null,null,"Zaměstnavatel"]
[null,null,"IČ",null,null,null,null,null,null,null,null,null,null,null,null,null,null,null,null,null,null,null,null,null,null,null,null,null,"IČ"]
[null,null,"Pracovní pozice",null,null,null,null,null,null,null,null,null,null,null,null,null,null,null,null,null,null,null,null,null,null,null,null,null,"Pracovní pozice"]
[]
[null,null,"Hlavní zdroj příjmu 2)",null,null,null,null,null,null,null,null,null,null,null,null,null,null,null,null,null,null,null,null,null,null,null,null,null,"Hlavní zdroj příjmu"]
[null,null,null,null,"závislá činnost",null,null,null,null,null,null,null,null,null,null,null,null,"v ČR",null,null,"v zahraničí",null,null,null,null,null,null,null,null,null,"závislá činnost",null,null,null,null,null,null,null,null,null,null,null,null,"v ČR",null,null,"v zahraničí"]
[]
[null,null,null,null,null,null,null,null,null,null,null,null,null,null,null,null,null,null,null,null,null,null,null,null,"Kč",null,null,null,null,null,null,null,null,null,null,null,null,null,null,null,null,null,null,null,null,null,null,null,null,null,"Kč"]
[null,null,null,null,null,"délka současného prac. poměru",null,null,null,null,null,null,null,null,null,null,null,null,null,null,null,"v letech",null,null,null,null,null,null,null,null,null,"délka současného prac. poměru",null,null,null,null,null,null,null,null,null,null,null,null,null,null,null,"v letech"]
[null,null,null,null,null,"délka předchozího prac. poměru",null,null,null,null,null,null,null,null,null,null,null,null,null,null,null,"v letech",null,null,null,null,null,null,null,null,null,"délka předchozího prac. poměru",null,null,null,null,null,null,null,null,null,null,null,null,null,null,null,"v letech"]
[]
[null,null,null,null,null,"zkušební / výpovědní doba 3)",null,null,null,null,null,null,null,null,null,null,null,"Ano",null,null,"Ne",null,null,null,null,null,null,null,null,null,null,"zkušební / výpovědní doba 3)",null,null,null,null,null,null,null,null,null,null,null,"Ano",null,null,"Ne"]
[]
[null,null,null,null,"samostatně výdělečná činnost",null,null,null,null,null,null,null,null,null,null,null,{"$f":"radek37","v":0},null,null,null,null,null,null,null,"Kč",null,null,null,null,null,"samostatně výdělečná činnost",null,null,null,null,null,null,null,null,null,null,null,null,null,null,null,null,null,null,null,"Kč"]
[]
[null,null,null,null,null,"aktivní nepřetržitě min. 12 měsíců",null,null,null,null,null,null,null,null,null,null,null,"Ano",null,null,"Ne",null,null,null,null,null,null,null,null,null,null,"aktivní nepřetržitě min. 12 měsíců",null,null,null,null,null,null,null,null,null,null,null,"Ano",null,null,"Ne"]
[]
[null,null,null,null,"příjem z pronájmu",null,null,null,null,null,null,null,null,null,null,null,null,null,null,null,null,null,null,null,"Kč",null,null,null,null,null,"příjem z pronájmu",null,null,null,null,null,null,null,null,null,null,null,null,null,null,null,null,null,null,null,"Kč"]
[]
[null,null,null,null,"příjem z kapitálového majetku",null,null,null,null,null,null,null,null,null,null,null,null,null,null,null,null,null,null,null,"Kč",null,null,null,null,null,"příjem z kapitálového majetku",null,null,null,null,null,null,null,null,null,null,null,null,null,null,null,null,null,null,null,"Kč"]
[]
[null,null,null,null,"starobní důchod",null,null,null,null,null,null,null,null,null,null,null,null,null,null,null,null,null,null,null,"Kč",null,null,null,null,null,"starobní důchod",null,null,null,null,null,null,null,null,null,null,null,null,null,null,null,null,null,null,null,"Kč"]
[]
[null,null,null,null,"jiný",null,null,null,null,null,null,null,null,null,null,null,null,null,null,null,null,null,null,null,"Kč",null,null,null,null,null,"jiný",null,null,null,null,null,null,null,null,null,null,null,null,null,null,null,null,null,null,null,"Kč"]
[]
[null,null,"Počet dospělých  v domácnosti včetně dětí ve věku 15-26",null,null,null,null,null,null,null,null,null,null,null,"Počet dětí v domácnosti (do 15 let)",null,null,null,null,null,null,null,null,null,null,null,null,null,"Počet dospělých  v domácnosti",null,null,null,null,null,null,null,null,null,null,null,"Počet dětí v domácnosti (do 26 let)"]
[]
[]
[null,null,null,null,null,null,null,null,null,null,null,null,null,null,"jako spolu/žadatel",null,null,null,null,null,null,"jako ručitel",null,null,null,null,null,null,null,null,null,null,null,null,null,null,null,null,null,null,"jako spolu/žadatel",null,null,null,null,null,null,"jako ručitel"]
[null,null,"Hypoteční úvěr, úvěr ze stavebního spoření",null,null,null,null,null,null,null,null,null,null,null,null,null,null,null,null,null,null,null,null,null,null,null,null,null,"Hypoteční úvěr, úvěr ze stavebního spoření"]
[null,null,"Osobní úvěr, leasing, splátkový prodej, zápůjčka",null,null,null,null,null,null,null,null,null,null,null,null,null,null,null,null,null,null,null,null,null,null,null,null,null,"Osobní úvěr, leasing, splátkový prodej, zápůjčka"]
[null,null,"Kontokorentní úvěr (vč. nevyužívaných)",null,null,null,null,null,null,null,null,null,null,null,null,null,null,null,null,null,null,null,null,null,null,null,null,null,"Kontokorentní úvěr (vč. nevyužívaných)"]
[null,null,"Kreditní karta (vč. nevyužívaných)",null,null,null,null,null,null,null,null,null,null,null,null,null,null,null,null,null,null,null,null,null,null,null,null,null,"Kreditní karta (vč. nevyužívaných)"]
[null,null,"Další pravidelné výdaje (výživné, spoření, pojištění)",null,null,null,null,null,null,null,null,null,null,null,null,null,null,null,null,null,null,null,null,null,null,null,null,null,"Další pravidelné výdaje (výživné, spoření, pojištění)"]
[null,null,"Náklady na bydlení",null,null,null,null,null,null,null,null,null,null,null,null,null,null,null,null,null,null,null,null,null,null,null,null,null,"Náklady na bydlení"]
[]
[null,null,"SPECIFIKACE ÚVĚRU"]
[null,null,"Typ úrokové sazby",null,null,null,null,null,null,null,null,null,null,null,null,null,null,null,null,null,null,null,null,"Délka čerpání úvěru (v měsících) 6)",null,null,null,null,null,null,null,null,null,null,null,null,null,"Mám zájem o slevu na úrokové sazbě za:"]
[null,null,null,"Fixní - délka fixace úrokové sazby (v letech) 4)",null,null,null,null,null,null,null,null,null,null,null,null,null,null,null,null,null,null,null,null,null,null,null,null,null,null,null,null,null,null,null,null,null,null,"Pojištění schopnosti splácet 7)"]
[]
[null,null,null,"Variabilní (Převratná hypotéka) 5)",null,null,null,null,null,null,null,null,null,null,"Variabilní s garancí",null,null,null,null,null,null,null,null,null,null,null,null,null,null,null,null,null,null,null,null,null,null,null,"Aktivní běžný účet 8)"]
[]
[null,null,null,null,null,null,null,null,null,null,null,null,null,null,null,null,null,null,null,null,null,null,null,null,null,null,null,null,null,null,null,null,null,null,null,null,null,null,"Aktivní kreditní kartu 9)"]
[null,null,"Účel úvěru"]
[null,null,null,"Koupě ",null,null,null,null,null,null,null,null,null,null,null,null,null,null,null,null,null,null,null,null,null,null,null,null,null,"Typ úvěru"]
[]
[null,null,null,"Refinancování ",null,null,null,null,null,null,null,null,null,null,null,null,null,null,null,null,null,null,null,null,null,null,null,null,null,null,"INDIVIDUAL - Hypoteční úvěr účelový"]
[]
[null,null,null,"Výstavba / Rekonstrukce",null,null,null,null,null,null,null,null,null,null,null,null,null,null,null,null,null,null,null,null,null,null,null,null,null,null,"FLEXI - Hypoteční úvěr s možností předčasné splátky "]
[]
[null,null,null,"Vypořádání majetkových poměrů spojených s nemovitostí",null,null,null,null,null,null,null,null,null,null,null,null,null,null,null,null,null,null,null,null,null,null,null,null,null,null,"TWIN - Hypoteční úvěr s kombinací neúčelové části "]
[]
[null,null,null,"Zpětné proplacení finančních prostředků",null,null,null,null,null,null,null,null,null,null,null,null,null,null,null,null,null,null,null,null,null,null,null,null,null,null,"Hypoteční úvěr účelový nerezidenční"]
[]
[null,null,null,"Jiný ",null,null,null,null,null,null,null,null,null,null,null,null,null,null,null,null,null,null,null,null,null,null,null,null,null,null,"Hypoteční úvěr neúčelový"]
[]
[null,null,"1) Za osoby, které mají k bance zvláštní vztah, se podle § 19 zákona č. 21/1992 Sb., o bankách, považují a) členové statutárního orgánu a vedoucí zaměstnanci banky, b) členové dozorčí rady banky, c) právnické osoby mající kontrolu nad bankou, jejich hlavní akcionáři a členové vedení těchto společností, d) osoby blízké členům statutárního orgánu, dozorčí rady, vedoucím zaměstnancům banky a osobám majícím kontrolu nad bankou, e) právnické osoby, ve kterých některá z osob uvedených pod písmeny a), b) a c) má podíl na základním jmění přesahující 10 %, f) hlavní akcionáři banky a jakákoliv právnická osoba pod jejich kontrolou, g) členové bankovní rady České národní banky, h) právnické osoby, nad kterými má banka kontrolu."]
[null,null,"2) Výše čistého měsíčního příjmu za poslední 3 měsíce. U osoby samostatně výdělečně činné za posledních 12 kalendářních měsíců."]
[null,null,"3) Nehodící se škrtněte."]
[null,null,"4) Déka fixace úrokové sazby je počet let, po které bude fixní úroková sazba neměnná."]
[null,null,"5) Úroková sazba je složena z variabilní a fixní složky, tj. její celková výše se mění v závislosti na situaci na finančním trhu."]
[null,null,"6) Období čerpání (od podpisu smlouvy do ukončení čerpání)."]
[null,null,"7) Úvěrové životní pojištění s jednorázově splatným pojistným, délka pojištění je 5 let, pojištění pro případ úmrtí + pracovní neschopnosti / ztráty zaměstnání / invalidity III. stupně. "]
[null,null,"8) Platí i pro stávajícího klienta UniCredit Bank v případě, že již službu využívá."]
[null,null,"9) Rámec kreditní karty je schválen současně s úvěrem. Karta je poskytnuta za zvýhodněných podmínek. Sleva platí i pro již existující kreditní kartu."]
[null,null,"10) Podmínky objednání odhadu Vám budou sděleny pracovníkem Banky, resp. pověřeným zástupcem Banky."]
[]
[null,null,"FINANCOVANÁ NEMOVITOST 1)"]
[null,null,"Adresa nemovitosti"]
[null,null,"Číslo listu vlastnictví",null,null,null,null,null,null,null,null,null,null,null,null,null,null,null,null,null,null,null,null,null,null,null,null,null,null,"Výše investice do nemovitosti"]
[]
[null,null,"Účel využití objektu úvěru",null,null,null,null,null,null,null,null,null,null,null,"vlastní bydlení (event. bydlení osoby blízké)",null,null,null,null,null,null,null,null,null,null,null,null,null,null,null,"rekreace",null,null,null,null,null,"pronájem"]
[]
[null,null,"ZASTAVENÁ NEMOVITOST"]
[null,null,null,null,"je totožná s objektem úvěru - níže uvedené údaje nevyplňujte a přejděte rovnou k podpisu žadatele a spolužadatele"]
[]
[null,null,null,null,"je odlišná od objektu úvěru"]
[null,null,"Vlastník nemovitosti",null,null,null,null,null,null,null,null,null,null,null,"žadatel nebo spolužadatel",null,null,null,null,null,null,null,null,null,null,"osoba blízká",null,null,null,null,null,null,"jiná osoba"]
[]
[null,null,"Adresa nemovitosti"]
[]
[null,null,"Účel využití objektu úvěru",null,null,null,null,null,null,null,null,null,null,null,"vlastní bydlení (event. bydlení osoby blízké)",null,null,null,null,null,null,null,null,null,null,null,null,null,null,null,"rekreace",null,null,null,null,null,"pronájem"]
[]
[null,null,"PROHLÁŠENÍ ŽADATELE A SPOLUŽADATELE"]
[null,null,"Prohlašuji, že veškeré údaje uvedené v těchto doplňujících informacích k žádosti o hypoteční úvěr, resp. v dokumentech přiložených, jsou úplné a odpovídají skutečnosti a že jsem nezamlčel(a) žádnou relevantní skutečnost, která by mohla ovlivnit rozhodnutí banky při poskytnutí úvěru."]
[null,null,"Prohlašuji, že úkon učiněný žadatelem nebo spolužadatelem vůči UniCredit Bank Czech Republic and Slovakia, a.s. do uzavření smlouvy o úvěru je úkonem učiněným jménem všech, tj žadatele a všech spolužadatelů. UniCredit Bank Czech Republic and Slovakia, a.s.  není povinna zkoumat vzájemné nároky těchto žadatelů a nenese žádnou odpovědnost za případné neoprávněné zásahy žadatelů do svých vzájemných nároků."]
[null,null,"Dále prohlašuji, že jsem plně způsobilý(á)  k právním úkonům."]
[null,null,"Dále prohlašuji, že nejsem v prodlení vůči státu nebo jinému subjektu s úhradou daní či poplatků, úhradou pojistného na sociální zabezpečení, zdravotní pojištění, úhradou cla nebo jiných povinných plateb a zároveň prohlašuji, že nemám jiné závazky vůči fyzickým či právnickým osobám s výjimkou uvedených výše v těchto doplňujících informacích k žádosti o hypoteční úvěr."]
[]
[]
[]
[]
[null,null,null,null,null,null,null,null,null,null,null,null,null,null,null,null,null,null,null,null,null,null,null,null,null,null,null,null,"Podpis žadatele"]
[]
[]
[]
[]
[null,null,"Místo, datum",null,null,null,null,null,null,null,null,null,null,null,null,null,null,null,null,null,null,null,null,null,null,null,null,null,"Podpis spolužadatele"]
[null,null,"Vyplní Banka"]
[null,null,"Totožnost žadatele/spolužadatele ověřil (jméno, příjmení):",null,null,null,null,null,null,null,null,null,null,null,null,null,null,null,null,null,null,null,null,null,null,null,null,null,"Dle občanských průkazů č. "]
[]
[null,null,"Dne:",null,null,null,null,null,null,null,null,null,null,null,"Podpis:"]
[]
[]
[null,null,"1) V případě zjednodušeného procesu refinancování přejděte k podpisu žadatele a spolužadatele. Informace o nemovitostech nevyplňujte"]
[null,"PŘÍLOHA K ŽÁDOSTI O POSKYTNUTÍ HYPOTEČNÍHO ÚVĚRU"]
[]
[]
[null,"VYHODNOCENÍ RIZIK SPOJENÝCH SE ZÁSTAVOU NEMOVITOSTI"]
[]
[]
[null,"Žadatel žádá o posouzení vhodnosti nemovitosti označené v žádosti jako zastavená nemovitost pro zřízení zástavního práva a zavazuje se uhradit cenu za vyhodnocení rizik spojených se zástavou nemovitosti dle sazebníku uvedeného níže."]
[null,"Žadatel bere na vědomí a souhlasí s tím, že k realizaci posouzení vhodnosti nemovitosti ze strany banky dojde  po předložení dokladu o zaplacení příslušné ceny, případně ověření úhrady této ceny. "]
[null,"Žadatel je za účelem realizace tohoto posouzení povinen zabezpečit přístup do předmětné nemovitosti a poskytnout součinnost při zajišťování potřebných listinných podkladů, jako je např. projektová dokumentace k nemovitosti, stavební povolení, kolaudační souhlas, nabývací titul, nájemní smlouvy apod."]
[null,"Žadatel je povinen uhradit cenu za vyhodnocení rizik spojených se zástavou nemovitosti na účet č. 2109626508/2700, přičemž jako variabilní symbol uvede své rodné číslo bez lomítka (občan bez rodného čísla uvede jako variabilní symbol datum svého narození ve formátu RRRRMMDD a do poznámky své jméno)."]
[]
[]
[]
[null,null,null,null,"SAZEBNÍK"]
[null,null,null,null,null,null,null,null,"Bytová jednotka v krajském městě (účel refinancování)",null,null,null,null,null,null,null,null,null,null,null,null,null,null,null,null,null,null,null,null,null,null,null,null,null,null,null,null,"zdarma"]
[null,null,null,null,null,null,null,null,"expresní vyhodnocení "]
[null,null,null,null,null,null,null,null,"Bytová jednotka",null,null,null,null,null,null,null,null,null,null,null,null,null,null,null,null,null,null,null,null,null,null,null,null,null,null,null,null,3700]
[null,null,null,null,null,null,null,null,"Pozemek"]
[null,null,null,null,null,null,null,null,"Rodinný dům",null,null,null,null,null,null,null,null,null,null,null,null,null,null,null,null,null,null,null,null,null,null,null,null,null,null,null,null,4900]
[null,null,null,null,null,null,null,null,"Objekt individuální rekreace   "]
[null,null,null,null,null,null,null,null,"Ostatní objekty"]
[]
[]
[]
[]
[]
[null,null,null,null,null,null,null,"Typy nemovitostí vhodné k zástavě:"]
[null,null,null,null,null,null,null,"Bytová jednotka",null,null,null,null,null,null,null,"Rodinný dům",null,null,null,null,null,null,null,"Objekt individuální rekreace chata/chalupa ",null,null,null,null,null,null,"Bytový dům",null,null,null,null,null,null,null,"Pozemek"]
[]
[]
[]
[]
[]
[]
[]
[]
[]
[null,null,null,null,null,null,null,null,null,null,null,null,null,null,null,null,null,null,null,null,null,null,null,null,null,null,null,null,"Podpis žadatele"]
[]
[null,"Poučení o zpracování osobních údajů\npodle § 11 zákona č. 101/2000 Sb., o ochraně osobních údajů („ZOOÚ“)"]
[]
[null,"Rozsah a účel zpracování osobních údajů"]
[null,"UniCredit Bank Czech Republic and Slovakia, a.s. (dále jen „Banka“) zpracovává osobní údaje klientů v rozsahu, v jakém jí jsou klienty poskytnuty v souvislosti s poskytováním jednotlivých bankovních produktů, za účelem jednání s klientem o smlouvě a pro poskytování bankovních služeb dle bankovní licence. Banka, pokud s tím klienti nevysloví písemný nesouhlas, zpracovává v zákonem daném rozsahu osobní údaje klientů rovněž i k nabízení obchodu nebo služeb klientům. Osobní údaje klientů týkající se jejich bonity a důvěryhodnosti Banka zpracovává v rozsahu, v jakém je v souladu se zákonem nebo s příslušným souhlasem klienta obdrží od klienta, z mezibankovních nebo jiných úvěrových registrů a dalších zdrojů."]
[]
[null,"Doba zpracování osobních údajů"]
[null,"Banka je podle § 16 zákona č. 253/2008 Sb., o některých opatřeních proti legalizaci výnosů z trestné činnosti a financování terorismu a ustanovení § 21 odst. 2 zákona č. 21/1992 Sb., o bankách, ve znění pozdějších předpisů (ZoB), povinna uchovávat osobní údaje a údaje a doklady o obchodech po dobu 10 let od uskutečnění obchodu nebo ukončení obchodního vztahu s klientem."]
[]
[null,"Způsob zpracování osobních údajů"]
[null,"Banka osobní údaje klientů zpracovává automatizovaně i manuálně při dodržení všech bezpečnostních zásad pro správu a zpracování osobních údajů a to buď sama anebo prostřednictvím zpracovatelů, s nimiž má uzavřenu smlouvu o zpracování osobních údajů v souladu s § 6 ZOOÚ. Veškerá místa, na kterých dochází ke zpracování osobních údajů Bankou nebo zpracovateli Banky, jsou nahlášena jako místa zpracování osobních údajů u Úřadu pro ochranu osobních údajů. Osobní údaje bez výslovného souhlasu klienta nebudou předávány do států, které mají horší pravidla pro nakládání s osobními údaji než Česká republika."]
[]
[null,"Dobrovolnost poskytnutí osobních údajů, následek odmítnutí "]
[null,"Poskytnutí osobních údajů klienta je dobrovolné. V rozsahu, v jakém je však Banka na základě zákona povinna osobní údaje klientů zjišťovat, zpracovávat a uchovávat, je však poskytnutí některých osobních údajů podmínkou pro poskytování služeb ze strany Banky. Těmito povinnými údaji jsou: všechna jména a příjmení, rodné číslo (nebylo-li přiděleno pak datum narození), místo narození, pohlaví, trvalý nebo jiný pobyt a státní občanství; jde-li o podnikající fyzickou osobu, též její obchodní firma, odlišující dodatek nebo další označení, sídlo a identifikační číslo, druh a číslo průkazu totožnosti, stát, popřípadě orgán, který jej vydal, a dobu jeho platnosti. "]
[null,"Poskytnutí zbývajících osobních údajů je závislé pouze na vůli klienta a Banka předáním těchto údajů nepodmiňuje poskytování bankovních služeb. Tím, že klient umožní ostatní osobní údaje zaznamenat do smlouvy, kterou s Bankou uzavře, bude takové jednání považováno za výslovné udělení souhlasu se zpracováním těchto osobních údajů Bankou a to po celou dobu trvání smluvních vztahů."]
[]
[null,"Komu mohou být osobní údaje zpřístupněny"]
[null,"Osobní údaje klientů mohou být zpřístupněny zaměstnancům Banky, osobám podílejícím se na vedení a řízení Banky, akcionářům Banky, osobám spolupracujícím s Bankou na plnění jejích povinností (včetně realizace práv a povinností vyplývajících ze smluv uzavřených s klientem), osobám oprávněným na základě jiných právních předpisů (např. orgánům dozoru, včetně orgánů dozoru v zemích sídel osob začleněných do koncernu UniCredit Group), osobám začleněným do koncernu UniCredit Group a osobám vedoucím mezibankovní informační systémy v zemích sídla akcionářů Banky a jiným zpracovatelům osobních údajů, popř. jejich zaměstnancům a to především pro účely plnění smlouvy s klientem, případně také pro zajištění ochrany rizik Banky a koncernu UniCredit Group, výkaznictví, auditu a vnitřní kontroly. "]
[null,"Tyto údaje mohou být zpřístupněny i dalším osobám v návaznosti na zvláštní souhlas klienta. Některé osobní údaje klientů (informace o bankovním spojení, identifikačních údajích majitelů účtů a záležitostech, které vypovídají o bonitě a důvěryhodnosti klientů) mohou být rovněž zpřístupněny dalším bankám nebo pobočkám zahraničních bank v rámci plnění povinnosti postupovat při výkonu své činnosti obezřetně, a to i prostřednictvím právnické osoby, která není bankou (§ 38a odst. 1 ZoB). "]
[]
[null,"Přístup subjektu údajů k informacím"]
[null,"Banka je povinna klienta na jeho žádost písemně informovat o tom, v jakém rozsahu a pro jaký účel jsou jeho osobní údaje zpracovávány, kdo a jakým způsobem bude osobní údaje zpracovávat a komu mohou být osobní údaje zpřístupněny. Přesný rozsah informace definuje § 12 odst. 2 ZOOÚ. Banka má právo za poskytnutí informace požadovat přiměřenou úhradu nepřevyšující náklady nezbytné na poskytnutí informace. "]
[]
[null,"Ochrana práv subjektu údajů"]
[null,"Klient, který se domnívá, že Banka nebo jí pověřený konkrétní zpracovatel provádí zpracování jeho osobních údajů, které je v rozporu s ochranou klienta nebo v rozporu se zákonem, zejména jsou-li osobní údaje nepřesné s ohledem na účel jejich zpracování, může požádat Banku nebo konkrétního zpracovatele o vysvětlení a požadovat, aby Banka nebo konkrétní zpracovatel odstranili takto vzniklý stav. Zejména se může jednat o blokování, provedení opravy, doplnění nebo likvidaci osobních údajů. Je-li žádost klienta oprávněná, Banka nebo konkrétní zpracovatel neprodleně závadný stav odstraní. Klient má rovněž právo obrátit se přímo na Úřad pro ochranu osobních údajů. Pokud vznikla v důsledku zpracování osobních údajů klienta jiná než majetková újma, postupuje se při uplatňování jejího nároku podle občanského zákoníku."]
[null,"Prohlášení k variabilní sazbě"]
[]
[]
[null,"Variabilní úroková sazba se skládá ze dvou složek: proměnné (variabilní) složky a pevné složky sazby."]
[]
[null,"Pevná složka úrokové sazby je sjednána ve smlouvě o úvěru pro dobu 5 let od 1.čerpání úvěru."]
[]
[null,"Variabilní složka úrokové sazby je závislá na vývoji referenční úrokové sazby 1M PRIBOR, tj. UniCredit Bank ji nemůže ovlivnit. Mění se v závislosti na vývoji sazeb na mezibankovním trhu."]
[]
[null,"Měsíční anuitní splátka se mění v závislosti na výši úrokové sazby (ovlivněné její variabilní složkou) a UniCredit Bank  při změně v předstihu oznamuje její novou výši."]
[]
[null,"Klient je povinen udržovat na účtu určeném ke splácení úvěru dostatečný objem prostředků ke splácení úvěru."]
[]
[null,"Změna úrokové sazby může ovlivnit schopnost klienta splácet úvěr."]
[null,"Dojde-li v období 12 kalendářních měsíců ke zvýšení úrokové sazby nejméně na dvojnásobek oproti sazbě na počátku tohoto období, je Banka oprávněna variabilní úrokovou sazbu změnit na úrokovou sazbu fixní, kterou bude v dané době s klienty sjednávat u úvěrů tohoto druhu na období jednoho roku. Přitom je povinna Klienta o této změně informovat, a to nejpozději  30 dnů před jejím provedením."]
[]
[null,"Klient může o přechod na fixní úrokovou sazbu požádat kdykoliv bez ohledu na vývoj úrokových sazeb s tím, že tato změna je možná pouze s účinností od 25. dne v kalendářním měsíci."]
[]
[null,"Prohlašuji, že jsem se seznámil s mechanismem změny variabilní úrokové sazby a jejími dopady. "]
[]
[]
[]
[]
[]
[null,null,null,null,null,null,null,null,null,null,null,null,null,null,null,null,null,null,null,null,null,null,null,null,null,null,null,"Podpis žadatele"]
[]
[]
[]
[]
[null,"Místo, datum",null,null,null,null,null,null,null,null,null,null,null,null,null,null,null,null,null,null,null,null,null,null,null,null,null,"Podpis spolužadatele"]
[null,"C. PŘIHLÁŠKA K POJIŠTĚNÍ SCHOPNOSTI SPLÁCET ÚVĚR"]
[]
[null,"POJIŠTĚNÝ:",null,null,null,null,null,"Hlavní žadatel",null,null,null,null,null,null,null,null,"NEBO",null,null,null,null,"Spolužadatel: "]
[null,null,null,null,null,null,null,null,null,null,null,null,null,null,null,null,null,null,null,null,null,null,null,null,null,null,null,null,null,null,null,null,null,null,null,null,null,null,"jméno a příjmení"]
[]
[null,"Sjednaným pojištěním schopnosti splácet splátky hypotečního úvěru  jsou kryta následující rizika žadatele, která jsou po celou pojistnou dobu neměnná:"]
[]
[null,"Soubor pojištění JP: jednorázově placené pojistné "]
[]
[null,null,null,"Soubor JP A: Úmrtí a pracovní neschopnost",null,null,null,null,null,null,null,null,null,null,null,null,null,null,null,null,"úhrada navýšením úvěru",null,null,null,null,null,null,null,null,null,"úhrada z účtu"]
[null,null,"Podpisem potvrzuji, že:"]
[null,null,"-    ","jsem byl(a) seznámen(a) s Rámcovou pojistnou smlouvou č. UCBHJP 1/2011, s níž, jakož i se Všeobecnými pojistnými podmínkami, souhlasím,"]
[null,null,"-   ","jsem mladší 60 let, resp. v případě hypotečního úvěru ve výši 5 000 001 Kč - 10 000 000 Kč jsem mladší 55 let,"]
[null,null,"-   ","jsem zdráv(a),"]
[null,null,"-   ","nejsem poživatelem starobního ani invalidního důchodu,"]
[null,null,"-   ","nejsem v pravidelné lékařské péči či pod pravidelným lékařským dohledem v důsledku zjištěného chronického onemocnění s trvalým užíváním léků,"]
[null,null,"-   ","nejsem v pracovní neschopnosti,"]
[null,null,"-   ","souhlasím s tím, že oprávněnou, příp. obmyšlenou, osobou pro výplatu pojistného plnění je pojistník (pojistníkem je UniCredit Bank),"]
[null,null,"-    ","mnou uvedené údaje v lékařském dotazníku jsou pravdivé a k dnešnímu dni se nezměnily  (lékařský dotazník se vyplňuje v případě hypotečního úvěru ve výši větší než 1 000 000 Kč). "]
[]
[null,null,null,"Soubor JP B: Úmrtí a ztráta zaměstnání",null,null,null,null,null,null,null,null,null,null,null,null,null,null,null,null,"úhrada navýšením úvěru",null,null,null,null,null,null,null,null,null,"úhrada z účtu"]
[null,null,"Podpisem potvrzuji, že:"]
[null,null,"-   ","jsem byl(a) seznámen(a) s Rámcovou pojistnou smlouvou č. UCBHJP 1/2011, s níž, jakož i se Všeobecnými pojistnými podmínkami, souhlasím,"]
[null,null,"-  ","mladší 60 let, resp. v případě hypotečního úvěru ve výši 5 000 001 Kč - 10 000 000 Kč jsem mladší 55 let,"]
[null,null,"-  ","jsem zdráv(a),"]
[null,null,"-   ","nejsem poživatelem starobního ani invalidního důchodu,"]
[null,null,"-   ","nejsem v pravidelné lékařské péči či pod pravidelným lékařským dohledem v důsledku zjištěného chronického onemocnění s trvalým užíváním léků,"]
[null,null,"-   ","nejsem v pracovní neschopnosti,"]
[null,null,"-   ","souhlasím s tím, že oprávněnou, příp. obmyšlenou, osobou pro výplatu pojistného plnění je pojistník (pojistníkem je UniCredit Bank),"]
[null,null,"-     ","mnou uvedené údaje v lékařském dotazníku jsou pravdivé a k dnešnímu dni se nezměnily (lékařský dotazník se vyplňuje v případě hypotečního úvěru ve výši větší než 1 000 000 Kč) "]
[null,null,"-    ","jsem zaměstnán(a) v pracovním poměru sjednaném na dobu neurčitou a byl(a) jsem zaměstnán(a) v pracovním poměru nepřetržitě též v předcházejících 12 měsících a nejsem ve zkušební době, nedal(a) jsem ani mi nebyla dána výpověď z pracovního poměru, nezrušil(a) jsem se zaměstnavatelem okamžitě pracovní poměr ani mi nebyl zrušen ze strany zaměstnavatele, neobdržel(a) jsem od zaměstnavatele ani jsem nezaslal(a) zaměstnavateli návrh na skončení pracovního poměru dohodou."]
[]
[null,null,null,"Soubor JP C: Úmrtí a invalidita III. stupně",null,null,null,null,null,null,null,null,null,null,null,null,null,null,null,null,"úhrada navýšením úvěru",null,null,null,null,null,null,null,null,null,"úhrada z účtu"]
[null,null,"Podpisem potvrzuji, že:"]
[null,null,"-    ","jsem byl(a) seznámen(a) s Rámcovou pojistnou smlouvou č. UCBHJP 1/2011, s níž, jakož i se Všeobecnými pojistnými podmínkami, souhlasím,"]
[null,null,"- ","mladší 60 let, resp. v případě hypotečního úvěru ve výši 5 000 001 Kč - 10 000 000 Kč jsem mladší 55 let,"]
[null,null,"-  ","jsem zdráv(a),"]
[null,null,"-   ","nejsem poživatelem starobního ani invalidního důchodu,"]
[null,null,"-   ","nejsem v pravidelné lékařské péči či pod pravidelným lékařským dohledem v důsledku zjištěného chronického onemocnění s trvalým užíváním léků,"]
[null,null,"-   ","nejsem v pracovní neschopnosti,"]
[null,null,"-   ","souhlasím s tím, že oprávněnou, příp. obmyšlenou, osobou pro výplatu pojistného plnění je pojistník (pojistníkem je UniCredit Bank),"]
[null,null,"-    ","mnou uvedené údaje v lékařském dotazníku jsou pravdivé a k dnešnímu dni se nezměnily (lékařský dotazník se vyplňuje v případě hypotečního úvěru ve výši větší než 1 000 000 Kč), "]
[]
[null,"Prohlášení společná pro všechny typy úvěrů"]
[null,null,null,"Podpisem dále  potvrzuji, že:"]
[null,null," -","souhlasím s tím, aby mé osobní údaje (včetně citlivých údajů o zdravotním stavu, včetně přičiny smrti) uvedené v této přihlášce a lékařském dotazníku, je-li vyplňován, stejně jako i jiné již dříve nebo naopak později předané či získané osobní údaje související s účastí v pojištění či se jí týkající (včetně údajů o závazku, k jehož zajištění má toto pojištění sloužit), byly zpracovány pojistitelem jako správcem osobních údajů, pojistníkem a jejich smluvními partnery (jako zpracovateli nebo osobami pověřenými zpracováním osobních údajů) pro účely pojišťovací činnosti, včetně šetření pojistné události, a ostatních činností prováděných v souladu s předpisy upravujícími pojišťovnictví, a to po dobu nezbytně nutnou k zajištění vzájemných práv a povinností a dále po dobu, po kterou je pojistitel povinen údaje uchovávat, a to vždy za účelem administrace Rámcové pojistné smlouvy č. UCBHJP 1/2011 a/nebo mé účasti v pojištění, jakož i za účelem ochrany práv správce; "]
[null,null,null,"zároveň prohlašuji, že jsem byl řádně informován v souladu s ust. § 11 a 21 zák. č.101/2000 Sb., o ochraně osobních údajů, o zpracování mých osobních údajů, jakož i o mých právech a povinnostech správce a zpracovatelů, včetně práva svůj souhlas kdykoliv částečně nebo úplně odvolat;"]
[]
[null,null," -","souhlasím s tím, aby v souladu s ust. § 50 odst. 1 zák. č. 37/2004 Sb., o pojistné smlouvě, pojistitel a/nebo jím pověření poskytovatelé zdravotních služeb (zdravotnická zařízení) vyžadovali, získávali a zpracovávali údaje a informace o mém zdravotním stavu, včetně příčiny smrti, jakož i zdravotnickou dokumentaci od kteréhokoliv poskytovatele zdravotních služeb (který mi poskytoval zdravotní služby) a tímto také tyto poskytovatele v souladu s ust. § 51 odst. 2, písm. b) zák. č. 372/2011 Sb., o zdravotních službách a podmínkách jejích poskytování, v platném znění, v platném znění, zprošťuji výslovně mlčenlivosti a autorizuji je k poskytování informací o mém zdravotním stavu, jakož i příčině smrti, jakož i k poskytování zdravotní dokumentace, a to vše i v období po mé smrti; dále tímto zplnomocňuji pojistitele k nahlížení do spisů a pořizování jejich kopií a výpisů u orgánů státní správy a samosprávy a dalších subjektů, týkajících se událostí, jež by mohly být posouzeny jako pojistná událost;"]
[null,null," -","se zavazuji, že bez zbytečného odkladu nahlásím jakoukoli změnu zpracovávaných osobních údajů,"]
[null,null," -","beru na vědomí, že v případě nepravdivosti nebo nepřesnosti i jen některého z mnou zde učiněných prohlášení, se vystavuji a beru na vědomí riziko, že pojistitel může přistoupit ke snížení nebo odmítnutí výplaty pojistného plnění nebo od mého pojištění odstoupit. "]
[]
[]
[]
[null,null,"V ",null,null,null,null,null,null,null,null,null,"dne"]
[null,null,null,null,null,null,null,null,null,null,null,null,null,null,null,null,null,null,null,null," Podpis pojištěného"]
[]
[null,"C. PŘIHLÁŠKA K POJIŠTĚNÍ SCHOPNOSTI SPLÁCET ÚVĚR"]
[]
[null,"POJIŠTĚNÝ:",null,null,null,null,null,"Hlavní žadatel",null,null,null,null,null,null,null,null,"NEBO",null,null,null,null,"Spolužadatel: "]
[null,null,null,null,null,null,null,null,null,null,null,null,null,null,null,null,null,null,null,null,null,null,null,null,null,null,null,null,null,null,null,null,null,null,null,null,null,null,"jméno a příjmení"]
[]
[]
[null,"Sjednaným pojištěním schopnosti splácet splátky hypotečního úvěru  jsou kryta následující rizika žadatele, která jsou po celou pojistnou dobu neměnná:"]
[]
[]
[null,"Soubor pojištění A: měsíčně placené pojistné"]
[null,null,null,"A: Úmrtí, invalidita III. stupně a pracovní neschopnost"]
[null,null,null,"Podpisem potvrzuji, že:"]
[null,null,"-","jsem byl(a) seznámen(a) s Rámcovou pojistnou smlouvou č. UCBH 1/2009, s níž, jakož i se Všeobecnými pojistnými podmínkami, souhlasím,"]
[null,null,"-","jsem mladší 60 let, resp. v případě hypotečního úvěru ve výši 5 000 001 Kč - 10 000 000 Kč jsem mladší 55 let,"]
[null,null,"-","jsem zdráv(a),"]
[null,null,"-","nejsem poživatelem starobního ani invalidního důchodu,"]
[null,null,"-","nejsem v pravidelné lékařské péči či pod pravidelným lékařským dohledem v důsledku zjištěného chronického onemocnění s trvalým užíváním léků,"]
[null,null,"-","nejsem v pracovní neschopnosti,"]
[null,null,"-","beru na vědomí a souhlasím s tím, že v případě porušení smlouvy o úvěru má pojistník právo jednostranně pozastavit úhrady splátek pojistného pojistiteli se všemi důsledky s tím spojenými, "]
[null,null,"-","souhlasím s tím, že oprávněnou, příp. obmyšlenou osobou pro výplatu pojistného plnění je pojistník,"]
[null,null,"-","mnou uvedené údaje v lékařském dotazníku jsou pravdivé a k dnešnímu dni se nezměnily (lékařský dotazník se vyplňuje v případě hypotečního úvěru ve výši větší než 1 000 000 Kč). "]
[]
[null,"Prohlášení společná pro všechny typy úvěrů"]
[null,null,null,"Podpisem dále  potvrzuji, že:"]
[null,null," -","souhlasím s tím, aby mé osobní údaje (včetně citlivých údajů o zdravotním stavu, včetně přičiny smrti) uvedené v této přihlášce a lékařském dotazníku, je-li vyplňován, stejně jako i jiné již dříve nebo naopak později předané či získané osobní údaje související s účastí v pojištění či se jí týkající (včetně údajů o závazku, k jehož zajištění má toto pojištění sloužit), byly zpracovány pojistitelem jako správcem osobních údajů, pojistníkem a jejich smluvními partnery (jako zpracovateli nebo osobami pověřenými zpracováním osobních údajů) pro účely pojišťovací činnosti, včetně šetření pojistné události, a ostatních činností prováděných v souladu s předpisy upravujícími pojišťovnictví, a to po dobu nezbytně nutnou k zajištění vzájemných práv a povinností a dále po dobu, po kterou je pojistitel povinen údaje uchovávat, a to vždy za účelem administrace Rámcové pojistné smlouvy č. UCBH 1/2009 a/nebo mé účasti v pojištění, jakož i za účelem ochrany práv správce; "]
[null,null,null,"zároveň prohlašuji, že jsem byl řádně informován v souladu s ust. §11 a 21 zák. č.101/2000 Sb., o ochraně osobních údajů, o zpracování mých osobních údajů, jakož i o mých právech a povinnostech správce a zpracovatelů, včetně práva svůj souhlas kdykoliv částečně nebo úplně odvolat; "]
[null,null," -","souhlasím s tím, aby v souladu s ust. § 50 odst. 1 zák. č. 37/2004 Sb., o pojistné smlouvě, pojistitel a/nebo jím pověření poskytovatelé zdravotních služeb (zdravotnická zařízení) vyžadovali, získávali a zpracovávali údaje a informace o mém zdravotním stavu, včetně příčiny smrti, jakož i zdravotnickou dokumentaci od kteréhokoliv poskytovatele zdravotních služeb (který mi poskytoval zdravotní služby) a tímto také tyto poskytovatele v souladu s ust. § 51 odst. 2, písm. b) zák. č. 372/2011 Sb., o zdravotních službách a podmínkách jejích poskytování, v platném znění, v platném znění, zprošťuji výslovně mlčenlivosti a autorizuji je k poskytování informací o mém zdravotním stavu, jakož i příčině smrti, jakož i k poskytování zdravotní dokumentace, a to vše i v období po mé smrti; dále tímto zplnomocňuji pojistitele k nahlížení do spisů a pořizování jejich kopií a výpisů u orgánů státní správy a samosprávy a dalších subjektů, týkajících se událostí, jež by mohly být posouzeny jako pojistná událost;"]
[null,null,null,"\nse zavazuji, že bez zbytečného odkladu nahlásím jakoukoli změnu zpracovávaných osobních údajů,"]
[null,null," -","beru na vědomí, že v případě nepravdivosti nebo nepřesnosti i jen některého z mnou zde učiněných prohlášení, se vystavuji a beru na vědomí riziko, že pojistitel může přistoupit ke snížení nebo odmítnutí výplaty pojistného plnění nebo od mého pojištění odstoupit."]
[]
[]
[]
[null,null,"V ",null,null,null,null,null,null,null,null,null,"dne"]
[null,null,null,null,null,null,null,null,null,null,null,null,null,null,null,null,null,null,null,null," Podpis pojištěného"]

{"sheet":"FIN_CLC","index":13,"n_rows":28,"n_cols":15,"rows_kept":28,"cut":false,"hidden":true,"merged":[[11,4,11,5],[1,2,1,7],[2,3,2,6],[3,2,3,3],[5,3,5,6],[7,4,7,5],[25,5,25,6],[27,1,31,11],[13,4,13,5],[15,3,15,5],[17,3,17,5],[20,3,20,4],[20,5,20,6],[22,3,22,6]]}
[]
[null,null,"Pomocník při výpočtu splatnosti v EUROSIGovských úvěrových aplikacích"]
[]
[null,null,"Zadejte typ úvěru",null,null,null,null,null,null,null,null,null,null,4]
[null,null,null,null,null,null,null,null,null,null,null,null,null,{"$f":"TODAY()","v":"2016-02-02"},{"$f":"DAY(N5)","v":2}]
[null,null,null,"FIN - parametry:",null,null,null,null,null,null,null,null,null,{"$f":"MID(I8,1,30)","v":""}]
[null,null,null,null,null,null,null,null,null,null,null,null,null,{"$f":"MID(I12,1,30)","v":""}]
[null,null,null,"ASD","(doba čerpání)",null,{"$f":"DatumDocerpani","v":0},{"$f":"IF(G8=1,\"měsíc\",IF(OR(G8=2,G8=3,G8=4),\"měsíce\",\"měsíců\"))","v":"měsíců"},{"$f":"IF(OR(N4=1,N4=3),IF(G8>0,\"POZOR!!! Vyplňte pouze hodnotu: 0\",\"\"),IF(OR(N4=2,N4=5),IF(G8>6,\"POZOR!!! Vyplňte pouze hodnotu: 0-6\",\"\"),IF(N4=7,IF(G8>6,\"POZOR!!! Vyplňte pouze hodnotu: 0-6\",\"\"),IF(N4=6,IF(G8>18,\"POZOR!!! Vyplňte pouze hodnotu: 0-18\",\"\"),IF(G8>24,\"POZOR!!! Vyplňte pouze hodnotu: 0-24\",\"\")))))","v":""}]
[]
[null,null,null,{"$f":"IF(N4=5,\"\",\"PSD\")","v":"PSD"},{"$f":"IF(N4=5,\"Odklad splátek\",\"(počet úrokových plateb po vyčerpání)\")","v":"(počet úrokových plateb po vyčerpání)"},null,1,{"$f":"IF(G10=1,\"měsíc\",IF(OR(G10=2,G10=3,G10=4),\"měsíce\",\"měsíců\"))","v":"měsíc"},{"$f":"IF(N4=8,IF(G10<12,\"POZOR!!! Vyplňte pouze hodnotu: 12 a více\",\"Uveďte dobu splatnosti x 12 měsíců\"),IF(N4=3,\"K výpočtu použijte kalkulačku na Studentskou půjčku\",IF(N4=5,IF(G10>12,\"POZOR!!! Vyplňte pouze hodnotu: 1-12\",\"\"),IF(N4<>5,IF(G10=1,\"\",\"POZOR!!! Vyplňte pouze hodnotu: 1\"),IF(G10=1,\"\",\"POZOR!!! Vyplňte pouze hodnotu: 1\")))))","v":""}]
[]
[null,null,null,"AMM","počet splátek",null,{"$f":"Splatnost","v":0},{"$f":"IF(G12=1,\"měsíc\",IF(OR(G12=2,G12=3,G12=4),\"měsíce\",\"měsíců\"))","v":"měsíců"},{"$f":"IF(N4=8,IF(G12>1,\"POZOR!!! Vyplňte pouze hodnotu: 1\",\"\"),IF(N4=2,IF(G12>120,\"POZOR!!! Vyplňte pouze hodnotu: 1-120 - dle platné metodiky\",\"\"),IF(N4=1,IF(G12>60,\"POZOR!!! Vyplňte pouze hodnotu: 1-60 - dle platné metodiky\",\"\"),IF(OR(N4=3,N4=7),IF(G12>120,\"POZOR!!! Vyplňte pouze hodnotu: 1-120\",\"\"),IF(OR(N4=4,N4=5),IF(G12>480,\"POZOR!!! Vyplňte pouze hodnotu: 1-480\",\"\"),IF(N4=6,IF(G12>180,\"POZOR!!! Vyplňte pouze hodnotu: 1-180\",\"\"),\"\"))))))","v":""}]
[]
[null,null,null,"Duration",null,null,{"$f":"IF(N4=5,G12+G8,G12+G10+G8)","v":1},{"$f":"IF(G14=1,\"měsíc\",IF(OR(G14=2,G14=3,G14=4),\"měsíce\",\"měsíců\"))","v":"měsíc"}]
[]
[null,null,null,"Předpoklad podpisu smlouvy do:",null,null,{"$f":"CLC_PodpisSml","v":3},{"$f":"IF(G16=1,\"měsíce\",\"měsíců\")","v":"měsíců"}]
[]
[null,null,null,"Délka fixního období",null,null,{"$f":"IF(LEFT(Fix_obdobi,1)>0,LEFT(Fix_obdobi,1),0)","v":"3"},{"$f":"IF(G18=1,\"rok\",IF(OR(G18=2,G18=3,G18=4),\"roky\",\"roků\"))","v":"roků"}]
[]
[null,null,null,null,null,{"$f":"IF(OR(N4=1,N4=2,N4=3),\"19.\",IF(OR(N4=4,N4=5),\"24.\",\"9.\"))","v":"24."},{"$f":"IF(O5<25,EDATE(N5,G18*12),EDATE(N5,G18*12+1))","v":"2019-02-02"}]
[null,null,null,"Předpokládané datum konce fixního období",null,{"$f":"DATE(YEAR(G20),MONTH(G20),LEFT(F20,2))","v":"2019-02-24"}]
[]
[null,null,null,"CL&C - datum splatnosti"]
[]
[null,null,null,null,null,{"$f":"IF(OR(N4=1,N4=2,N4=3),\"20.\",IF(OR(N4=4,N4=5),\"25.\",\"10.\"))","v":"25."},{"$f":"EDATE(N5,IF(OR(N4=1,N4=2,N4=3),G12+G16+1,G14+G16+1))","v":"2016-07-02"}]
[null,null,null,"vypočtené dle parametrů ve FINu",null,{"$f":"DATE(YEAR(G25),MONTH(G25),LEFT(F25,2))","v":"2016-07-25"}]
[]
[null,"V případě, že se Vám v poli \"Předpokládané datum konce fixního období\" a \"CL&C - datum splatnosti\" nezobrazuje správně datum (v poli je #NÁZEV?), musíte si povolit rozšířené funkce a poté excel znovu otevřít:\nNástroje -> Doplňky -> a zde zaškrnout pole Analysis ToolPak"]

{"sheet":"Domain","index":14,"n_rows":31,"n_cols":16,"rows_kept":31,"cut":false,"hidden":true,"merged":[]}
["Povolené produkty","Prod\nKód","FIXList","StandardList","Typ Nemovitosti:","Nem\nKód","Žadatel","Rodné číslo","Příjmy","Mapping","Typklienta","Bydliště+osob","Náklad domacnosti","Bydliště +typ osoby","Osobní náklady","typ úvěru (fin_clc"]
["Hypoteční úvěr účelový rezidenční Individual","01a","Float","S","zděná nemovitost nebo pozemek","ZDE","Občan ČR","Má české nebo slovenské RČ","Česká republika","OMČ","S","Praha1",3400,"PrahaDosp",4100,"Osobní úvěr - neúčelový"]
["Hypoteční úvěr účelový rezidenční Twin","01e","1 rok","N","montovaný rodinný dům","MON","Občan SR bez trvalého pobytu","Nemá","Závislá činnost v zahraničí","CMČ","S","Praha2",4500,"PrahaDite",3900,"Osobní úvěr - účelový"]
["Hypoteční úvěr účelový nerezidenční","02","2 roky",null,"chata, chalupa","PBR","Cizinec s trvalým pobytem",null,"Podnikání v zahraničí - NEAKCEPTOVÁNO","CNČ","N","Praha3",5100,"Ostatní kraje ČRDosp",3600,"Studentská půjčka"]
["Hypoteční úvěr neúčelový","03","3 roky",null,null,"PBN","Jiný",null,null,"JMČ","N","Praha4",5700,"Ostatní kraje ČRDite",3500,"Hypoteční úvěr - IND"]
["Hypoteční úvěr účelový rezidenční Flexi","01c","5 let",null,null,"CHA",null,null,null,"JNČ","N","Praha5",6200,"Mimo ČRDosp",{"$f":"O2*1.5","v":6150},"Hypoteční úvěr s odkladem splátek - IND"]
[null,null,"7 let",null,null,null,null,null,null,"JČ","N","Praha6",6600,"Mimo ČRDite",{"$f":"O3*1.5","v":5850},"Hypoteční úvěr - SB"]
[null,null,"10 let",null,null,null,null,null,null,"OMZ","S","Praha7",6900,null,null,"Investiční úvěr"]
[null,null,null,null,null,null,null,null,null,"ONZ","S","Praha8",7100,null,null,"Hypoteční úvěr kombinovaný "]
[null,null,null,null,null,null,null,null,null,"OZ","S","Praha9",7200]
[null,null,null,null,null,null,null,null,null,"ONČ","S","Praha10",7200]
[null,null,null,null,null,null,null,null,null,"SMČ","S","Ostatní kraje ČR1",3000]
[null,null,null,null,null,null,null,null,null,"SNČ","S","Ostatní kraje ČR2",3900]
[null,null,null,null,null,null,null,null,null,"SČ","S","Ostatní kraje ČR3",4500]
[null,null,null,null,null,null,null,null,null,null,null,"Ostatní kraje ČR4",5000]
[null,null,null,null,null,null,null,null,null,null,null,"Ostatní kraje ČR5",5500]
[null,null,null,null,null,null,null,null,null,null,null,"Ostatní kraje ČR6",5900]
[null,null,null,null,null,null,null,null,null,null,null,"Ostatní kraje ČR7",6200]
[null,null,null,null,null,null,null,null,null,null,null,"Ostatní kraje ČR8",6400]
[null,null,null,null,null,null,null,null,null,null,null,"Ostatní kraje ČR9",6500]
[null,null,null,null,null,null,null,null,null,null,null,"Ostatní kraje ČR10",6500]
[null,null,null,null,null,null,null,null,null,null,null,"Mimo ČR1",{"$f":"M2*1.5","v":5100}]
[null,null,null,null,null,null,null,null,null,null,null,"Mimo ČR2",6750]
[null,null,null,null,null,null,null,null,null,null,null,"Mimo ČR3",7650]
[null,null,null,null,null,null,null,null,null,null,null,"Mimo ČR4",8550]
[null,null,null,null,null,null,null,null,null,null,null,"Mimo ČR5",9300]
[null,null,null,null,null,null,null,null,null,null,null,"Mimo ČR6",9900]
[null,null,null,null,null,null,null,null,null,null,null,"Mimo ČR7",10350]
[null,null,null,null,null,null,null,null,null,null,null,"Mimo ČR8",10650]
[null,null,null,null,null,null,null,null,null,null,null,"Mimo ČR9",10800]
[null,null,null,null,null,null,null,null,null,null,null,"Mimo ČR10",10800]

{"sheet":"ALM_Hypo","index":15,"n_rows":52,"n_cols":26,"rows_kept":52,"cut":false,"hidden":true,"merged":[[11,13,11,22],[0,19,0,22],[0,24,0,25],[5,9,5,22],[6,9,6,22],[9,13,9,22],[26,9,26,24],[13,13,13,22],[15,13,15,22],[17,13,17,22],[18,13,18,22],[19,13,19,22],[20,13,20,22],[21,13,21,22],[22,13,22,22],[23,13,23,22],[24,13,24,22],[25,9,25,24],[44,13,44,22],[46,13,46,22],[48,13,48,22],[28,9,28,24],[31,13,31,22],[33,13,33,22],[35,13,35,22],[40,19,40,20],[42,13,42,22]]}
["Úrokové sazby pro výpočet sazeb hypotéčních úvěrů v CZK",null,null,null,null,null,null,null,null,null,null,null,null,null,null,null,null,null,null,"Jen pro vnitřní potřebu !",null,null,null,null,"Platnost pro období"]
["Perioda","Typ","Splatnost","FTP Bid","FTP Offer",null,null,null,null,null,null,null,null,null,null,null,null,null,null,null,null,null,null,null,"Od:","2016-02-01"]
["SPOT","MM","2013-04-02",null,"MMcurve    act/360",null,null,null,null,null,null,null,null,null,null,null,null,null,null,null,null,null,null,null,"Do:","2016-02-29"]
["1W","MM","2013-04-09",0.19,0.23]
["2W","MM","2013-04-16",0.19,0.23]
["1M","MM","2013-05-02",0.27,0.31,null,null,null,null,"Tabulka referenčních úrokových sazeb pro standardní hypotéční úvěry v CZK"]
["2M","MM","2013-06-02",0.33,0.37,null,null,null,null,"(úvěry pro úvěry do 20 mio. CZK)"]
["3M","MM","2013-07-02",0.43,0.47]
["6M","MM","2013-10-02",0.55000000000000004,0.59,null,null,null,null,"Perioda",null,null,null,1,2,3,4,5,6,7,8,9,10]
["9M","MM","2014-01-02",0.66,0.7,null,null,null,null,"Typ sazby ","Splatnost","Forward","Profil Čerpání","Market Rate (fixní sazba)"]
["12M","MM","2014-04-02",0.41699707062549884,0.4769970706254989,null,null,null,null,"FIX",20,3,1,3.8999999999999998E-3,3.8999999999999998E-3,3.8E-3,4.1000000000000003E-3,4.5999999999999999E-3,5.1999999999999998E-3,5.7999999999999996E-3,6.4999999999999997E-3,7.1999999999999998E-3,7.7000000000000002E-3]
["SPOT","IRS","2013-04-02",null,"IRScurve    act/360",null,null,null,null,"Typ sazby ","Splatnost","Forward","Profil Čerpání","Special Refinancing Spread"]
["1R","IRS","2014-04-02",0.46500000000000002,0.46500000000000002,null,null,null,null,"FIX",20,3,1,1E-4,1E-4,2.9999999999999997E-4,7.000000000000001E-4,8.9999999999999998E-4,2.2000000000000001E-3,3.0999999999999999E-3,4.3E-3,5.4000000000000003E-3,6.1999999999999998E-3]
["2R","IRS","2015-04-02",0.625,0.625,null,null,null,null,"Typ sazby ","Splatnost","Forward","Profil Čerpání","Option Spread"]
["3R","IRS","2016-04-02",0.71,0.71,null,null,null,null,"FIX",20,3,1,3.0000000000000001E-3,3.0000000000000001E-3,3.0000000000000001E-3,3.0000000000000001E-3,3.0000000000000001E-3,3.0000000000000001E-3,3.0000000000000001E-3,3.0000000000000001E-3,3.0000000000000001E-3,3.0000000000000001E-3]
["4R","IRS","2017-04-02",0.79,0.79,null,null,null,null,"Typ sazby ","Splatnost","Forward","Profil Čerpání","Option Spread - prepayment option"]
["5R","IRS","2018-04-02",0.875,0.875,null,null,null,null,"FIX",20,3,1,2.0000000000000001E-4,2.0000000000000001E-4,2.0000000000000001E-4,2.0000000000000001E-4,2.0000000000000001E-4,2.0000000000000001E-4,2.0000000000000001E-4,2.0000000000000001E-4,2.0000000000000001E-4,2.0000000000000001E-4]
["6R","IRS","2019-04-02",0.97499999999999998,0.97499999999999998,null,null,null,null,"Typ sazby ","Splatnost","Forward","Profil Čerpání","Special Refinancing Spread"]
["7R","IRS","2020-04-02",1.07,1.07,null,null,null,null,"FLOAT",15,0,0,8.9999999999999998E-4]
["8R","IRS","2021-04-02",1.165,1.165,null,null,null,null,"Typ sazby ","Splatnost","Forward","Profil Čerpání","Basis Risk Spread/Market Rate Penalty"]
["9R","IRS","2022-04-02",1.2549999999999999,1.2549999999999999,null,null,null,null,"FLOAT",15,0,0,1.2999999999999999E-3]
["10R","IRS","2023-04-02",1.345,1.345,null,null,null,null,"Typ sazby ","Splatnost","Forward","Profil Čerpání","Special Refinancing Spread"]
["11R","IRS","2024-04-02",1.4251567693100857,1.4251567693100857,null,null,null,null,"FLOAT2",15,0,0,8.9999999999999998E-4]
["12R","IRS","2025-04-02",1.51,1.51,null,null,null,null,"Typ sazby ","Splatnost","Forward","Profil Čerpání","Option Spread"]
["13R","IRS","2026-04-02",1.5737923821330559,1.5737923821330559,null,null,null,null,"FLOAT2",15,0,0,3.8999999999999998E-3]
[null,null,null,null,null,null,null,null,null,"Funding u typu sazby \"FIX\" je součtem Market Rate a Special Refinancing Spread, u sazby typu \"FLOAT\" (BMR) je Special Refinancing Spread zvýšený o Market Rate Penalty, u sazby typu \"FLOAT2\" (BMR2) je součástí fundingu Special Refinancing Spread a Option S"]
[null,null,null,null,null,null,null,null,null,"V případě Hypotéčního úvěru FLEXI je Funding součtem Market Rate, Special Refinancing Spread a Option Spread;\nve všech ostatních případech s fixní sazbou je Funding součtem Market Rate, Special Refinancing Spread a Option Spread - undrawdown"]
[null,null,null,null,null,null,null,null,null,"Pozn.: v MR pro nové úvěry je obsažena opce na garanci sazby klientovi po dobu 2 týdnů ve výši:",null,null,null,null,null,null,null,null,null,null,null,null,0]
["15R","IRS","2028-04-02",1.71,1.71,null,null,null,null,"V případě Hypotéčního úvěru FLEXI je Funding součtem Market Rate, Special Refinancing Spread a Option Spread;\nve všech ostatních případech s fixní sazbou je Funding součtem Market Rate, Special Refinancing Spread a Option Spread - undrawdown"]
["16R","IRS","2029-04-02",1.7370904729972181,1.7370904729972181,null,null,null,null,"Pozn.: v MR pro nové úvěry je obsažena opce na garanci sazby klientovi po dobu 2 týdnů ve výši:",null,null,null,null,null,null,null,null,null,null,null,null,0]
["17R","IRS","2030-04-02",1.7646205363951268,1.7646205363951268,null,null,null,null,"FIX",null,null,null,5.7000000000000002E-3,6.7999999999999996E-3,7.6E-3,8.5000000000000006E-3,9.4999999999999998E-3,1.04E-2,1.12E-2,1.2E-2,1.2800000000000001E-2,1.34E-2]
["18R","IRS","2031-04-02",1.7925973254778462,1.7925973254778462,null,null,null,null,"Typ sazby ",null,null,null,"Special Refinancing Spread"]
["19R","IRS","2032-04-02",1.8211066142113159,1.8211066142113159,null,null,null,null,"FIX",null,null,null,5.8999999999999999E-3,5.8999999999999999E-3,6.7000000000000002E-3,7.3000000000000001E-3,8.199999999999999E-3,8.6999999999999994E-3,9.4999999999999998E-3,1.04E-2,1.11E-2,1.1899999999999999E-2]
["20R","IRS","2033-04-02",1.85,1.85,null,null,null,null,"Typ sazby ",null,null,null,"Option Spread"]
[null,null,null,null,null,null,null,null,null,"FIX",null,null,null,3.0000000000000001E-3,3.0000000000000001E-3,3.0000000000000001E-3,3.0000000000000001E-3,3.0000000000000001E-3,3.0000000000000001E-3,3.0000000000000001E-3,3.0000000000000001E-3,3.0000000000000001E-3,3.0000000000000001E-3]
[null,null,null,null,null,null,null,null,null,"Typ sazby ",null,null,null,"Option Spread - undrawdown"]
[null,null,null,null,null,null,null,null,null,"FIX",null,null,null,2.9999999999999997E-4,2.9999999999999997E-4,2.9999999999999997E-4,2.9999999999999997E-4,2.9999999999999997E-4,2.9999999999999997E-4,2.9999999999999997E-4,2.9999999999999997E-4,2.9999999999999997E-4,2.9999999999999997E-4]
[null,null,null,null,null,null,null,null,null,"Standard Funding",null,null,null,1.1899999999999999E-2,1.2999999999999999E-2,1.46E-2,1.6100000000000003E-2,1.8000000000000002E-2,1.9400000000000001E-2,2.1000000000000001E-2,2.2700000000000001E-2,2.4200000000000003E-2,2.5600000000000001E-2]
[null,null,null,null,null,null,null,null,null,"Funding with early prepayment option",null,null,null,1.4599999999999998E-2,1.5699999999999999E-2,1.7299999999999999E-2,1.8800000000000001E-2,2.07E-2,2.2099999999999998E-2,2.3699999999999999E-2,2.5399999999999999E-2,2.69E-2,2.8299999999999999E-2]
[]
[null,null,null,null,null,null,null,null,null,"Q4 - Refinancing from 1/10/2013 to 31/12/2013"]
[null,null,null,null,null,null,null,null,null,"Perioda",null,null,null,1,2,3,4,5,6,7,8,9,10]
[null,null,null,null,null,null,null,null,null,"Typ sazby ",null,null,null,"Market Rate (fixní sazba)"]
[null,null,null,null,null,null,null,null,null,"FIX",null,null,null,5.7000000000000002E-3,6.7999999999999996E-3,7.6E-3,8.5000000000000006E-3,9.4999999999999998E-3,1.04E-2,1.12E-2,1.2E-2,1.2800000000000001E-2,1.34E-2]
[null,null,null,null,null,null,null,null,null,"Typ sazby ",null,null,null,"Special Refinancing Spread"]
[null,null,null,null,null,null,null,null,null,"FIX",null,null,null,5.8999999999999999E-3,5.8999999999999999E-3,6.7000000000000002E-3,7.3000000000000001E-3,8.199999999999999E-3,8.6999999999999994E-3,9.4999999999999998E-3,1.04E-2,1.11E-2,1.1899999999999999E-2]
[null,null,null,null,null,null,null,null,null,"Typ sazby ",null,null,null,"Option Spread"]
[null,null,null,null,null,null,null,null,null,"FIX",null,null,null,3.0000000000000001E-3,3.0000000000000001E-3,3.0000000000000001E-3,3.0000000000000001E-3,3.0000000000000001E-3,3.0000000000000001E-3,3.0000000000000001E-3,3.0000000000000001E-3,3.0000000000000001E-3,3.0000000000000001E-3]
[null,null,null,null,null,null,null,null,null,"Typ sazby ",null,null,null,"Option Spread - undrawdown"]
[null,null,null,null,null,null,null,null,null,"FIX",null,null,null,2.9999999999999997E-4,2.9999999999999997E-4,2.9999999999999997E-4,2.9999999999999997E-4,2.9999999999999997E-4,2.9999999999999997E-4,2.9999999999999997E-4,2.9999999999999997E-4,2.9999999999999997E-4,2.9999999999999997E-4]
[null,null,null,null,null,null,null,null,null,"Standard Funding",null,null,null,1.1899999999999999E-2,1.2999999999999999E-2,1.46E-2,1.6100000000000003E-2,1.8000000000000002E-2,1.9400000000000001E-2,2.1000000000000001E-2,2.2700000000000001E-2,2.4200000000000003E-2,2.5600000000000001E-2]
[null,null,null,null,null,null,null,null,null,"Funding with early prepayment option",null,null,null,1.4599999999999998E-2,1.5699999999999999E-2,1.7299999999999999E-2,1.8800000000000001E-2,2.07E-2,2.2099999999999998E-2,2.3699999999999999E-2,2.5399999999999999E-2,2.69E-2,2.8299999999999999E-2]

{"sheet":"Defsazby","index":16,"n_rows":413,"n_cols":25,"rows_kept":413,"cut":false,"hidden":true,"merged":[]}
["TYP_ID","DATUM","CCY","FIX","LTV_MIN","LTV_MAX","SPLATNOST_MIN","SPLATNOST_MAX","VYSE_MIN","VYSE_MAX","RATE","SLEVA_CF","SLEVA_CP","SLEVA_AB","SLEVA_KK","SLEVA_ABFL",null,"aktuální BMR","maximální BMR","Market Rate (MR)","Option Spread (OS)","Special Refinancing Spread (SRS)","Funding rate","Risk Margin (RM)","Basic Commercial Margin\n (CM)"]
["01a_N","2016-02-01","CZK","Fl",0,85,0,30,999999,999999999,{"$f":"T2+U2+V2+X2+Y2","v":2.9699999999999998},0.3,null,null,0.1,0.5,"BMR2",3.7000000000000002E-3,9.2999999999999992E-3,{"$f":"T22","v":0.26},{"$f":"U22","v":0},{"$f":"V22","v":0.21999999999999997},{"$f":"T2+U2+V2","v":0.48},{"$f":"X22+0.38","v":0.72},{"$f":"Y22","v":1.77}]
["01a_N",{"$f":"$B$2","v":"2016-02-01"},"CZK","Fl",85,100,0,30,999999,999999999,{"$f":"T3+U3+V3+X3+Y3","v":4.4700000000000006},0.3,null,null,0.1,0.5,"BMR1",2.5999999999999999E-3,"x",{"$f":"T22","v":0.26},{"$f":"U22","v":0},{"$f":"V22","v":0.21999999999999997},{"$f":"T3+U3+V3","v":0.48},{"$f":"X23+0.38","v":1.2200000000000002},{"$f":"Y23","v":2.77}]
["01a_N",{"$f":"$B$2","v":"2016-02-01"},"CZK","1 ",0,85,0,30,999999,999999999,5.3199999999999994,0.3,0.3,0.5,0.1,null,null,null,null,{"$f":"T24","v":0.38999999999999996},{"$f":"U24","v":0.02},{"$f":"V24","v":0.01},0.42,0.72,4.18]
["01a_N","2016-02-01","CZK","1 ",90,100,0,30,999999,999999999,6.82,0.3,0.3,0.5,0.1,null,null,null,null,{"$f":"T24","v":0.38999999999999996},{"$f":"U24","v":0.02},{"$f":"V24","v":0.01},0.42,1.2200000000000002,5.18]
["01a_N","2016-02-01","CZK","1 ",85,90,0,30,999999,999999999,6.82,0.3,0.3,0.5,0.1,null,null,null,null,{"$f":"T24","v":0.38999999999999996},{"$f":"U24","v":0.02},{"$f":"V24","v":0.01},0.42,1.2200000000000002,5.18]
["01a_N","2016-02-01","CZK","10",0,85,0,30,999999,999999999,4.43,0.3,0.3,0.5,0.1,null,null,null,null,{"$f":"T27","v":0.77},{"$f":"U27","v":0.02},{"$f":"V27","v":0.62},1.4100000000000001,0.72,2.2999999999999998]
["01a_N","2016-02-01","CZK","10",90,100,0,30,999999,999999999,5.93,0.3,0.3,0.5,0.1,null,null,null,null,{"$f":"T27","v":0.77},{"$f":"U27","v":0.02},{"$f":"V27","v":0.62},1.4100000000000001,1.2200000000000002,3.3]
["01a_N","2016-02-01","CZK","10",85,90,0,30,999999,999999999,5.93,0.3,0.3,0.5,0.1,null,null,null,null,{"$f":"T27","v":0.77},{"$f":"U27","v":0.02},{"$f":"V27","v":0.62},1.4100000000000001,1.2200000000000002,3.3]
["01a_N","2016-02-01","CZK","2 ",0,85,0,30,999999,999999999,3.2699999999999996,0.3,0.3,0.5,0.1,null,null,null,null,{"$f":"T30","v":0.38999999999999996},{"$f":"U30","v":0.02},{"$f":"V30","v":0.01},0.42,0.72,2.13]
["01a_N","2016-02-01","CZK","2 ",85,100,0,30,999999,999999999,4.7699999999999996,0.3,0.3,0.5,0.1,null,null,null,null,{"$f":"T30","v":0.38999999999999996},{"$f":"U30","v":0.02},{"$f":"V30","v":0.01},0.42,1.2200000000000002,3.13]
["01a_N","2016-02-01","CZK","3 ",0,85,0,30,999999,999999999,2.87,0.3,0.3,0.5,0.1,null,null,null,null,{"$f":"T32","v":0.38},{"$f":"U32","v":0.02},{"$f":"V32","v":0.03},0.43000000000000005,0.72,1.72]
["01a_N","2016-02-01","CZK","3 ",90,100,0,30,999999,999999999,4.37,0.3,0.3,0.5,0.1,null,null,null,null,{"$f":"T32","v":0.38},{"$f":"U32","v":0.02},{"$f":"V32","v":0.03},0.43000000000000005,1.2200000000000002,2.7199999999999998]
["01a_N","2016-02-01","CZK","3 ",85,90,0,30,999999,999999999,4.37,0.3,0.3,0.5,0.1,null,null,null,null,{"$f":"T32","v":0.38},{"$f":"U32","v":0.02},{"$f":"V32","v":0.03},0.43000000000000005,1.2200000000000002,2.7199999999999998]
["01a_N","2016-02-01","CZK","5 ",0,85,0,30,999999,999999999,2.87,0.3,0.3,0.5,0.1,null,null,null,null,{"$f":"T35","v":0.45999999999999996},{"$f":"U35","v":0.02},{"$f":"V35","v":0.09},0.56999999999999995,0.72,1.58]
["01a_N","2016-02-01","CZK","5 ",85,90,0,30,999999,999999999,4.37,0.3,0.3,0.5,0.1,null,null,null,null,{"$f":"T35","v":0.45999999999999996},{"$f":"U35","v":0.02},{"$f":"V35","v":0.09},0.56999999999999995,1.2200000000000002,2.58]
["01a_N","2016-02-01","CZK","5 ",90,100,0,30,999999,999999999,4.37,0.3,0.3,0.5,0.1,null,null,null,null,{"$f":"T35","v":0.45999999999999996},{"$f":"U35","v":0.02},{"$f":"V35","v":0.09},0.56999999999999995,1.2200000000000002,2.58]
["01a_N","2016-02-01","CZK","7 ",0,85,0,30,999999,999999999,3.57,0.3,0.3,0.5,0.1,null,null,null,null,{"$f":"T38","v":0.57999999999999996},{"$f":"U38","v":0.02},{"$f":"V38","v":0.31},0.90999999999999992,0.72,1.94]
["01a_N","2016-02-01","CZK","7 ",85,100,0,30,999999,999999999,5.07,0.3,0.3,0.5,0.1,null,null,null,null,{"$f":"T38","v":0.57999999999999996},{"$f":"U38","v":0.02},{"$f":"V38","v":0.31},0.90999999999999992,1.2200000000000002,2.94]
["01a_N","2016-02-01","CZK","CA",0,85,0,30,999999,999999999,3.57,0.3,null,null,0.1,0.5,null,null,null,{"$f":"T40","v":0.37},{"$f":"U40","v":0.38999999999999996},{"$f":"V40","v":0.09},0.85,0.72,2]
["01a_N","2016-02-01","CZK","CA",85,100,0,30,999999,999999999,5.07,0.3,null,null,0.1,0.5,null,null,null,{"$f":"T40","v":0.37},{"$f":"U40","v":0.38999999999999996},{"$f":"V40","v":0.09},0.85,1.2200000000000002,3]
["01a_S","2016-02-01","CZK","Fl",0,85,0,30,999999,999999999,2.59,0.3,null,null,0.1,0.5,null,null,null,{"$f":"R3*100","v":0.26},0,{"$f":"(ALM_Hypo!N19+ALM_Hypo!N21)*100","v":0.21999999999999997},0.48,{"$f":"X24","v":0.34},1.77]
["01a_S","2016-02-01","CZK","Fl",85,100,0,30,999999,999999999,4.09,0.3,null,null,0.1,0.5,null,null,null,{"$f":"T22","v":0.26},0,{"$f":"V22","v":0.21999999999999997},0.48,{"$f":"X25","v":0.84000000000000008},{"$f":"Y22+1","v":2.77}]
["01a_S","2016-02-01","CZK","1 ",0,85,0,30,999999,999999999,4.9399999999999995,0.3,0.3,0.5,0.1,null,null,null,null,{"$f":"ALM_Hypo!N11*100","v":0.38999999999999996},{"$f":"ALM_Hypo!N17*100","v":0.02},{"$f":"ALM_Hypo!N13*100","v":0.01},0.42,0.34,4.18]
["01a_S","2016-02-01","CZK","1 ",90,100,0,30,999999,999999999,6.4399999999999995,0.3,0.3,0.5,0.1,null,null,null,null,{"$f":"T24","v":0.38999999999999996},{"$f":"U24","v":0.02},{"$f":"V24","v":0.01},0.42,{"$f":"X24+0.5","v":0.84000000000000008},{"$f":"Y24+1","v":5.18}]
["01a_S","2016-02-01","CZK","1 ",85,90,0,30,999999,999999999,6.4399999999999995,0.3,0.3,0.5,0.1,null,null,null,null,{"$f":"T24","v":0.38999999999999996},{"$f":"U24","v":0.02},{"$f":"V24","v":0.01},0.42,{"$f":"X24+0.5","v":0.84000000000000008},{"$f":"Y24+1","v":5.18}]
["01a_S","2016-02-01","CZK","10",0,85,0,30,999999,999999999,4.05,0.3,0.3,0.5,0.1,null,null,null,null,{"$f":"ALM_Hypo!W11*100","v":0.77},{"$f":"ALM_Hypo!W17*100","v":0.02},{"$f":"ALM_Hypo!W13*100","v":0.62},1.4100000000000001,{"$f":"X24","v":0.34},2.2999999999999998]
["01a_S","2016-02-01","CZK","10",90,100,0,30,999999,999999999,5.55,0.3,0.3,0.5,0.1,null,null,null,null,{"$f":"T27","v":0.77},{"$f":"U27","v":0.02},{"$f":"V27","v":0.62},1.4100000000000001,{"$f":"X25","v":0.84000000000000008},{"$f":"Y27+1","v":3.3}]
["01a_S","2016-02-01","CZK","10",85,90,0,30,999999,999999999,5.55,0.3,0.3,0.5,0.1,null,null,null,null,{"$f":"T27","v":0.77},{"$f":"U27","v":0.02},{"$f":"V27","v":0.62},1.4100000000000001,{"$f":"X26","v":0.84000000000000008},{"$f":"Y27+1","v":3.3}]
["01a_S","2016-02-01","CZK","2 ",0,85,0,30,999999,999999999,2.8899999999999997,0.3,0.3,0.5,0.1,null,null,null,null,{"$f":"ALM_Hypo!O11*100","v":0.38999999999999996},{"$f":"ALM_Hypo!O17*100","v":0.02},{"$f":"ALM_Hypo!O13*100","v":0.01},0.42,{"$f":"X24","v":0.34},2.13]
["01a_S","2016-02-01","CZK","2 ",85,100,0,30,999999,999999999,4.3899999999999997,0.3,0.3,0.5,0.1,null,null,null,null,{"$f":"T30","v":0.38999999999999996},{"$f":"U30","v":0.02},{"$f":"V30","v":0.01},0.42,{"$f":"X25","v":0.84000000000000008},{"$f":"Y30+1","v":3.13}]
["01a_S","2016-02-01","CZK","3 ",0,85,0,30,999999,999999999,2.4900000000000002,0.3,0.3,0.5,0.1,null,null,null,null,{"$f":"ALM_Hypo!P11*100","v":0.38},{"$f":"ALM_Hypo!P17*100","v":0.02},{"$f":"ALM_Hypo!P13*100","v":0.03},0.43000000000000005,{"$f":"X24","v":0.34},1.72]
["01a_S","2016-02-01","CZK","3 ",90,100,0,30,999999,999999999,3.9899999999999998,0.3,0.3,0.5,0.1,null,null,null,null,{"$f":"T32","v":0.38},{"$f":"U32","v":0.02},{"$f":"V32","v":0.03},0.43000000000000005,{"$f":"X25","v":0.84000000000000008},{"$f":"Y32+1","v":2.7199999999999998}]
["01a_S","2016-02-01","CZK","3 ",85,90,0,30,999999,999999999,3.9899999999999998,0.3,0.3,0.5,0.1,null,null,null,null,{"$f":"T32","v":0.38},{"$f":"U32","v":0.02},{"$f":"V32","v":0.03},0.43000000000000005,{"$f":"X26","v":0.84000000000000008},{"$f":"Y32+1","v":2.7199999999999998}]
["01a_S","2016-02-01","CZK","5 ",0,85,0,30,999999,999999999,2.4900000000000002,0.3,0.3,0.5,0.1,null,null,null,null,{"$f":"ALM_Hypo!R11*100","v":0.45999999999999996},{"$f":"ALM_Hypo!R17*100","v":0.02},{"$f":"ALM_Hypo!R13*100","v":0.09},0.56999999999999995,{"$f":"X24","v":0.34},1.58]
["01a_S","2016-02-01","CZK","5 ",85,90,0,30,999999,999999999,3.99,0.3,0.3,0.5,0.1,null,null,null,null,{"$f":"T35","v":0.45999999999999996},{"$f":"U35","v":0.02},{"$f":"V35","v":0.09},0.56999999999999995,{"$f":"X25","v":0.84000000000000008},{"$f":"Y35+1","v":2.58}]
["01a_S","2016-02-01","CZK","5 ",90,100,0,30,999999,999999999,3.99,0.3,0.3,0.5,0.1,null,null,null,null,{"$f":"T35","v":0.45999999999999996},{"$f":"U35","v":0.02},{"$f":"V35","v":0.09},0.56999999999999995,{"$f":"X26","v":0.84000000000000008},{"$f":"Y35+1","v":2.58}]
["01a_S","2016-02-01","CZK","7 ",0,85,0,30,999999,999999999,3.19,0.3,0.3,0.5,0.1,null,null,null,null,{"$f":"ALM_Hypo!T11*100","v":0.57999999999999996},{"$f":"ALM_Hypo!T17*100","v":0.02},{"$f":"ALM_Hypo!T13*100","v":0.31},0.90999999999999992,{"$f":"X24","v":0.34},1.94]
["01a_S","2016-02-01","CZK","7 ",85,100,0,30,999999,999999999,4.6899999999999995,0.3,0.3,0.5,0.1,null,null,null,null,{"$f":"T38","v":0.57999999999999996},{"$f":"U38","v":0.02},{"$f":"V38","v":0.31},0.90999999999999992,{"$f":"X25","v":0.84000000000000008},{"$f":"Y38+1","v":2.94}]
["01a_S","2016-02-01","CZK","CA",0,85,0,30,999999,999999999,3.19,0.3,null,null,0.1,0.5,null,null,null,{"$f":"R2*100","v":0.37},{"$f":"ALM_Hypo!N25*100","v":0.38999999999999996},{"$f":"ALM_Hypo!N23*100","v":0.09},0.85,{"$f":"X24","v":0.34},2]
["01a_S","2016-02-01","CZK","CA",85,100,0,30,999999,999999999,4.6899999999999995,0.3,null,null,0.1,0.5,null,null,null,{"$f":"T40","v":0.37},{"$f":"U40","v":0.38999999999999996},{"$f":"V40","v":0.09},0.85,{"$f":"X25","v":0.84000000000000008},{"$f":"Y40+1","v":3}]
["01c_N","2016-02-01","CZK","1 ",0,85,0,30,999999,999999999,5.8199999999999994,0.3,0.3,0.5,0.1,null,null,null,null,{"$f":"T58","v":0.38999999999999996},{"$f":"U58","v":0.3},{"$f":"V58","v":0.01},0.7,{"$f":"X58+0.38","v":0.72},{"$f":"Y58","v":4.3999999999999995}]
["01c_N","2016-02-01","CZK","1 ",90,100,0,30,999999,999999999,7.3199999999999994,0.3,0.3,0.5,0.1,null,null,null,null,{"$f":"T59","v":0.38999999999999996},0.3,0.01,0.7,{"$f":"X59+0.38","v":1.2200000000000002},{"$f":"Y59","v":5.3999999999999995}]
["01c_N","2016-02-01","CZK","1 ",85,90,0,30,999999,999999999,7.3199999999999994,0.3,0.3,0.5,0.1,null,null,null,null,0.38999999999999996,0.3,0.01,0.7,1.2200000000000002,{"$f":"Y60","v":5.3999999999999995}]
["01c_N","2016-02-01","CZK","10",0,85,0,30,999999,999999999,4.93,0.3,0.3,0.5,0.1,null,null,null,null,0.77,0.3,0.62,1.69,0.72,{"$f":"Y61","v":2.52}]
["01c_N","2016-02-01","CZK","10",85,90,0,30,999999,999999999,6.43,0.3,0.3,0.5,0.1,null,null,null,null,0.77,0.3,0.62,1.69,1.2200000000000002,3.52]
["01c_N","2016-02-01","CZK","10",90,100,0,30,999999,999999999,6.43,0.3,0.3,0.5,0.1,null,null,null,null,0.77,0.3,0.62,1.69,1.2200000000000002,3.52]
["01c_N","2016-02-01","CZK","2 ",0,85,0,30,999999,999999999,3.77,0.3,0.3,0.5,0.1,null,null,null,null,0.38999999999999996,0.3,0.01,0.7,0.72,2.35]
["01c_N","2016-02-01","CZK","2 ",85,100,0,30,999999,999999999,5.2700000000000005,0.3,0.3,0.5,0.1,null,null,null,null,0.38999999999999996,0.3,0.01,0.7,1.2200000000000002,3.35]
["01c_N","2016-02-01","CZK","3 ",0,85,0,30,999999,999999999,3.37,0.3,0.3,0.5,0.1,null,null,null,null,0.38,0.3,0.03,0.71,0.72,1.94]
["01c_N","2016-02-01","CZK","3 ",90,100,0,30,999999,999999999,4.87,0.3,0.3,0.5,0.1,null,null,null,null,0.38,0.3,0.03,0.71,1.2200000000000002,2.94]
["01c_N","2016-02-01","CZK","3 ",85,90,0,30,999999,999999999,4.87,0.3,0.3,0.5,0.1,null,null,null,null,0.38,0.3,0.03,0.71,1.2200000000000002,2.94]
["01c_N","2016-02-01","CZK","5 ",0,85,0,30,999999,999999999,3.37,0.3,0.3,0.5,0.1,null,null,null,null,0.45999999999999996,0.3,0.09,0.85,0.72,1.8]
["01c_N","2016-02-01","CZK","5 ",85,90,0,30,999999,999999999,4.870000000000001,0.3,0.3,0.5,0.1,null,null,null,null,0.45999999999999996,0.3,0.09,0.85,1.2200000000000002,2.8000000000000003]
["01c_N","2016-02-01","CZK","5 ",90,100,0,30,999999,999999999,4.870000000000001,0.3,0.3,0.5,0.1,null,null,null,null,0.45999999999999996,0.3,0.09,0.85,1.2200000000000002,2.8000000000000003]
["01c_N","2016-02-01","CZK","7 ",0,85,0,30,999999,999999999,4.07,0.3,0.3,0.5,0.1,null,null,null,null,0.57999999999999996,0.3,0.31,1.19,0.72,2.16]
["01c_N","2016-02-01","CZK","7 ",85,100,0,30,999999,999999999,5.57,0.3,0.3,0.5,0.1,null,null,null,null,0.57999999999999996,0.3,0.31,1.19,1.2200000000000002,3.16]
["01c_S","2016-02-01","CZK","1 ",0,85,0,30,999999,999999999,5.4399999999999995,0.3,0.3,0.5,0.1,null,null,null,null,{"$f":"T24","v":0.38999999999999996},0.3,{"$f":"V24","v":0.01},0.7,{"$f":"X24","v":0.34},{"$f":"Y24+0.22","v":4.3999999999999995}]
["01c_S","2016-02-01","CZK","1 ",90,100,0,30,999999,999999999,6.9399999999999995,0.3,0.3,0.5,0.1,null,null,null,null,{"$f":"T25","v":0.38999999999999996},{"$f":"U58","v":0.3},{"$f":"V25","v":0.01},0.7,{"$f":"X25","v":0.84000000000000008},{"$f":"Y25+0.22","v":5.3999999999999995}]
["01c_S","2016-02-01","CZK","1 ",85,90,0,30,999999,999999999,6.9399999999999995,0.3,0.3,0.5,0.1,null,null,null,null,0.38999999999999996,{"$f":"U58","v":0.3},0.01,0.7,0.84000000000000008,{"$f":"Y26+0.22","v":5.3999999999999995}]
["01c_S","2016-02-01","CZK","10",0,85,0,30,999999,999999999,4.55,0.3,0.3,0.5,0.1,null,null,null,null,0.77,0.3,0.62,1.69,0.34,{"$f":"Y27+0.22","v":2.52}]
["01c_S","2016-02-01","CZK","10",85,90,0,30,999999,999999999,6.0500000000000007,0.3,0.3,0.5,0.1,null,null,null,null,0.77,{"$f":"U61","v":0.3},0.62,1.69,0.84000000000000008,3.52]
["01c_S","2016-02-01","CZK","10",90,100,0,30,999999,999999999,6.0500000000000007,0.3,0.3,0.5,0.1,null,null,null,null,0.77,{"$f":"U61","v":0.3},0.62,1.69,0.84000000000000008,3.52]
["01c_S","2016-02-01","CZK","2 ",0,85,0,30,999999,999999999,3.39,0.3,0.3,0.5,0.1,null,null,null,null,0.38999999999999996,0.3,0.01,0.7,0.34,2.35]
["01c_S","2016-02-01","CZK","2 ",85,100,0,30,999999,999999999,4.8900000000000006,0.3,0.3,0.5,0.1,null,null,null,null,0.38999999999999996,{"$f":"U64","v":0.3},0.01,0.7,0.84000000000000008,3.35]
["01c_S","2016-02-01","CZK","3 ",0,85,0,30,999999,999999999,2.99,0.3,0.3,0.5,0.1,null,null,null,null,0.38,0.3,0.03,0.71,0.34,1.94]
["01c_S","2016-02-01","CZK","3 ",90,100,0,30,999999,999999999,{"$f":"T67+U67+V67+X67+Y67","v":4.49},0.3,0.3,0.5,0.1,null,null,null,null,0.38,{"$f":"U66","v":0.3},0.03,{"$f":"T67+U67+V67","v":0.71},0.84000000000000008,2.94]
["01c_S",{"$f":"$B$2","v":"2016-02-01"},"CZK","3 ",85,90,0,30,999999,999999999,4.49,0.3,0.3,0.5,0.1,null,null,null,null,0.38,{"$f":"U66","v":0.3},0.03,0.71,0.84000000000000008,2.94]
["01c_S","2016-02-01","CZK","5 ",0,85,0,30,999999,999999999,2.99,0.3,0.3,0.5,0.1,null,null,null,null,0.45999999999999996,0.3,0.09,0.85,0.34,1.8]
["01c_S","2016-02-01","CZK","5 ",85,90,0,30,999999,999999999,4.49,0.3,0.3,0.5,0.1,null,null,null,null,0.45999999999999996,{"$f":"U69","v":0.3},0.09,0.85,0.84000000000000008,2.8000000000000003]
["01c_S","2016-02-01","CZK","5 ",90,100,0,30,999999,999999999,4.49,0.3,0.3,0.5,0.1,null,null,null,null,0.45999999999999996,{"$f":"U69","v":0.3},0.09,0.85,0.84000000000000008,2.8000000000000003]
["01c_S","2016-02-01","CZK","7 ",0,85,0,30,999999,999999999,3.6900000000000004,0.3,0.3,0.5,0.1,null,null,null,null,0.57999999999999996,0.3,0.31,1.19,0.34,2.16]
["01c_S","2016-02-01","CZK","7 ",85,100,0,30,999999,999999999,5.19,0.3,0.3,0.5,0.1,null,null,null,null,0.57999999999999996,{"$f":"U72","v":0.3},0.31,1.19,0.84000000000000008,3.16]
["01d_N","2016-02-01","CZK","Fl",0,85,0,30,999999,999999999,17,0.3,null,null,0.1,0.5,null,null,null,1,2,3,6,5,6]
["01d_N","2016-02-01","CZK","Fl",85,100,0,30,999999,999999999,17,0.3,null,null,0.1,0.5,null,null,null,1,2,3,6,5,6]
["01d_N","2016-02-01","CZK","10",0,85,0,30,999999,999999999,17,0.3,0.3,0.5,0.1,null,null,null,null,1,2,3,6,5,6]
["01d_N","2016-02-01","CZK","10",85,90,0,30,999999,999999999,17,0.3,0.3,0.5,0.1,null,null,null,null,1,2,3,6,5,6]
["01d_N","2016-02-01","CZK","10",90,100,0,30,999999,999999999,17,0.3,0.3,0.5,0.1,null,null,null,null,1,2,3,6,5,6]
["01d_N","2016-02-01","CZK","3 ",0,85,0,30,999999,999999999,17,0.3,0.3,0.5,0.1,null,null,null,null,1,2,3,6,5,6]
["01d_N","2016-02-01","CZK","3 ",90,100,0,30,999999,999999999,17,0.3,0.3,0.5,0.1,null,null,null,null,1,2,3,6,5,6]
["01d_N","2016-02-01","CZK","3 ",85,90,0,30,999999,999999999,17,0.3,0.3,0.5,0.1,null,null,null,null,1,2,3,6,5,6]
["01d_N","2016-02-01","CZK","5 ",0,85,0,30,999999,999999999,17,0.3,0.3,0.5,0.1,null,null,null,null,1,2,3,6,5,6]
["01d_N","2016-02-01","CZK","5 ",85,90,0,30,999999,999999999,17,0.3,0.3,0.5,0.1,null,null,null,null,1,2,3,6,5,6]
["01d_N","2016-02-01","CZK","5 ",90,100,0,30,999999,999999999,17,0.3,0.3,0.5,0.1,null,null,null,null,1,2,3,6,5,6]
["01d_N","2016-02-01","CZK","7 ",0,85,0,30,999999,999999999,17,0.3,null,null,0.1,0.5,null,null,null,1,2,3,6,5,6]
["01d_N","2016-02-01","CZK","7 ",85,100,0,30,999999,999999999,17,0.3,null,null,0.1,0.5,null,null,null,1,2,3,6,5,6]
["01d_N","2016-02-01","CZK","CA",0,85,0,30,999999,999999999,17,0.3,null,null,0.1,0.5,null,null,null,1,2,3,6,5,6]
["01d_N","2016-02-01","CZK","CA",85,100,0,30,999999,999999999,17,0.3,null,null,0.1,0.5,null,null,null,1,2,3,6,5,6]
["01d_S","2016-02-01","CZK","Fl",0,85,0,30,999999,999999999,17,0.3,null,null,0.1,0.5,null,null,null,1,2,3,6,5,6]
["01d_S","2016-02-01","CZK","Fl",85,100,0,30,999999,999999999,17,0.3,null,null,0.1,0.5,null,null,null,1,2,3,6,5,6]
["01d_S","2016-02-01","CZK","10",0,85,0,30,999999,999999999,17,0.3,0.3,0.5,0.1,null,null,null,null,1,2,3,6,5,6]
["01d_S","2016-02-01","CZK","10",85,90,0,30,999999,999999999,17,0.3,0.3,0.5,0.1,null,null,null,null,1,2,3,6,5,6]
["01d_S","2016-02-01","CZK","10",90,100,0,30,999999,999999999,17,0.3,0.3,0.5,0.1,null,null,null,null,1,2,3,6,5,6]
["01d_S","2016-02-01","CZK","3 ",0,85,0,30,999999,999999999,17,0.3,0.3,0.5,0.1,null,null,null,null,1,2,3,6,5,6]
["01d_S","2016-02-01","CZK","3 ",90,100,0,30,999999,999999999,17,0.3,0.3,0.5,0.1,null,null,null,null,1,2,3,6,5,6]
["01d_S","2016-02-01","CZK","3 ",85,90,0,30,999999,999999999,17,0.3,0.3,0.5,0.1,null,null,null,null,1,2,3,6,5,6]
["01d_S","2016-02-01","CZK","5 ",0,85,0,30,999999,999999999,17,0.3,0.3,0.5,0.1,null,null,null,null,1,2,3,6,5,6]
["01d_S","2016-02-01","CZK","5 ",85,90,0,30,999999,999999999,17,0.3,0.3,0.5,0.1,null,null,null,null,1,2,3,6,5,6]
["01d_S","2016-02-01","CZK","5 ",90,100,0,30,999999,999999999,17,0.3,0.3,0.5,0.1,null,null,null,null,1,2,3,6,5,6]
["01d_S","2016-02-01","CZK","7 ",0,85,0,30,999999,999999999,17,0.3,null,null,0.1,0.5,null,null,null,1,2,3,6,5,6]
["01d_S","2016-02-01","CZK","7 ",85,100,0,30,999999,999999999,17,0.3,null,null,0.1,0.5,null,null,null,1,2,3,6,5,6]
["01d_S","2016-02-01","CZK","CA",0,85,0,30,999999,999999999,17,0.3,null,null,0.1,0.5,null,null,null,1,2,3,6,5,6]
["01d_S","2016-02-01","CZK","CA",85,100,0,30,999999,999999999,17,0.3,null,null,0.1,0.5,null,null,null,1,2,3,6,5,6]
["01e_N","2016-02-01","CZK","Fl",0,85,0,30,999999,999999999,3.17,0.3,null,null,0.1,0.5,null,null,null,{"$f":"T124","v":0.26},{"$f":"U124","v":0},{"$f":"V124","v":0.21999999999999997},0.48,{"$f":"X124+0.38","v":0.84000000000000008},{"$f":"Y124","v":1.85}]
["01e_N","2016-02-01","CZK","Fl",85,100,0,30,999999,999999999,4.67,0.3,null,null,0.1,0.5,null,null,null,{"$f":"T125","v":0.26},0,0.21999999999999997,0.48,{"$f":"X125+0.38","v":1.34},{"$f":"Y125","v":2.85}]
["01e_N","2016-02-01","CZK","1 ",0,85,0,30,999999,999999999,5.52,0.3,0.3,0.5,0.1,null,null,null,null,0.38999999999999996,0.02,0.01,0.42,0.84000000000000008,4.26]
["01e_N","2016-02-01","CZK","1 ",85,90,0,30,999999,999999999,7.02,0.3,0.3,0.5,0.1,null,null,null,null,0.38999999999999996,0.02,0.01,0.42,1.34,5.26]
["01e_N","2016-02-01","CZK","1 ",90,100,0,30,999999,999999999,7.02,0.3,0.3,0.5,0.1,null,null,null,null,0.38999999999999996,0.02,0.01,0.42,1.34,5.26]
["01e_N","2016-02-01","CZK","10",0,85,0,30,999999,999999999,4.63,0.3,0.3,0.5,0.1,null,null,null,null,0.77,0.02,0.62,1.4100000000000001,0.84000000000000008,2.38]
["01e_N","2016-02-01","CZK","10",85,90,0,30,999999,999999999,6.13,0.3,0.3,0.5,0.1,null,null,null,null,0.77,0.02,0.62,1.4100000000000001,1.34,3.38]
["01e_N","2016-02-01","CZK","10",90,100,0,30,999999,999999999,6.13,0.3,0.3,0.5,0.1,null,null,null,null,0.77,0.02,0.62,1.4100000000000001,1.34,3.38]
["01e_N","2016-02-01","CZK","2 ",0,85,0,30,999999,999999999,3.4699999999999998,0.3,0.3,0.5,0.1,null,null,null,null,0.38999999999999996,0.02,0.01,0.42,0.84000000000000008,2.21]
["01e_N","2016-02-01","CZK","2 ",85,100,0,30,999999,999999999,4.97,0.3,0.3,0.5,0.1,null,null,null,null,0.38999999999999996,0.02,0.01,0.42,1.34,3.21]
["01e_N","2016-02-01","CZK","3 ",0,85,0,30,999999,999999999,3.0700000000000003,0.3,0.3,0.5,0.1,null,null,null,null,0.38,0.02,0.03,0.43000000000000005,0.84000000000000008,1.8]
["01e_N","2016-02-01","CZK","3 ",85,90,0,30,999999,999999999,4.57,0.3,0.3,0.5,0.1,null,null,null,null,0.38,0.02,0.03,0.43000000000000005,1.34,2.8]
["01e_N","2016-02-01","CZK","3 ",90,100,0,30,999999,999999999,4.57,0.3,0.3,0.5,0.1,null,null,null,null,0.38,0.02,0.03,0.43000000000000005,1.34,2.8]
["01e_N","2016-02-01","CZK","5 ",0,85,0,30,999999,999999999,3.0700000000000003,0.3,0.3,0.5,0.1,null,null,null,null,0.45999999999999996,0.02,0.09,0.56999999999999995,0.84000000000000008,1.6600000000000001]
["01e_N","2016-02-01","CZK","5 ",85,90,0,30,999999,999999999,4.57,0.3,0.3,0.5,0.1,null,null,null,null,0.45999999999999996,0.02,0.09,0.56999999999999995,1.34,2.66]
["01e_N","2016-02-01","CZK","5 ",90,100,0,30,999999,999999999,4.57,0.3,0.3,0.5,0.1,null,null,null,null,0.45999999999999996,0.02,0.09,0.56999999999999995,1.34,2.66]
["01e_N","2016-02-01","CZK","7 ",0,85,0,30,999999,999999999,3.77,0.3,0.3,0.5,0.1,null,null,null,null,0.57999999999999996,0.02,0.31,0.90999999999999992,0.84000000000000008,2.02]
["01e_N","2016-02-01","CZK","7 ",85,100,0,30,999999,999999999,5.27,0.3,0.3,0.5,0.1,null,null,null,null,{"$f":"T141","v":0.57999999999999996},0.02,0.31,0.90999999999999992,1.34,3.02]
["01e_N","2016-02-01","CZK","CA",0,85,0,30,999999,999999999,3.77,0.3,null,null,0.1,0.5,null,null,null,0.37,0.38999999999999996,0.09,0.85,0.84000000000000008,2.08]
["01e_N","2016-02-01","CZK","CA",85,100,0,30,999999,999999999,5.27,0.3,null,null,0.1,0.5,null,null,null,0.37,0.38999999999999996,0.09,0.85,1.34,3.08]
["01e_S","2016-02-01","CZK","Fl",0,85,0,30,999999,999999999,2.79,0.3,null,null,0.1,0.5,null,null,null,{"$f":"T22","v":0.26},{"$f":"U22","v":0},{"$f":"V22","v":0.21999999999999997},0.48,{"$f":"X22+0.12","v":0.46},{"$f":"Y22+0.08","v":1.85}]
["01e_S","2016-02-01","CZK","Fl",85,100,0,30,999999,999999999,4.29,0.3,null,null,0.1,0.5,null,null,null,{"$f":"T23","v":0.26},0,0.21999999999999997,0.48,{"$f":"X23+0.12","v":0.96000000000000008},{"$f":"Y23+0.08","v":2.85}]
["01e_S","2016-02-01","CZK","1 ",0,85,0,30,999999,999999999,5.14,0.3,0.3,0.5,0.1,null,null,null,null,0.38999999999999996,0.02,0.01,0.42,0.46,4.26]
["01e_S","2016-02-01","CZK","1 ",85,90,0,30,999999,999999999,6.64,0.3,0.3,0.5,0.1,null,null,null,null,0.38999999999999996,0.02,0.01,0.42,0.96000000000000008,5.26]
["01e_S","2016-02-01","CZK","1 ",90,100,0,30,999999,999999999,6.64,0.3,0.3,0.5,0.1,null,null,null,null,0.38999999999999996,0.02,0.01,0.42,0.96000000000000008,5.26]
["01e_S","2016-02-01","CZK","10",0,85,0,30,999999,999999999,4.25,0.3,0.3,0.5,0.1,null,null,null,null,0.77,0.02,0.62,1.4100000000000001,0.46,2.38]
["01e_S","2016-02-01","CZK","10",85,90,0,30,999999,999999999,5.75,0.3,0.3,0.5,0.1,null,null,null,null,0.77,0.02,0.62,1.4100000000000001,0.96000000000000008,3.38]
["01e_S","2016-02-01","CZK","10",90,100,0,30,999999,999999999,{"$f":"T131+U131+V131+X131+Y131","v":5.75},0.3,0.3,0.5,0.1,null,null,null,null,0.77,0.02,0.62,{"$f":"T131+U131+V131","v":1.4100000000000001},0.96000000000000008,3.38]
["01e_S",{"$f":"$B$2","v":"2016-02-01"},"CZK","2 ",0,85,0,30,999999,999999999,3.09,0.3,0.3,0.5,0.1,null,null,null,null,0.38999999999999996,0.02,0.01,0.42,0.46,2.21]
["01e_S","2016-02-01","CZK","2 ",85,100,0,30,999999,999999999,4.59,0.3,0.3,0.5,0.1,null,null,null,null,0.38999999999999996,0.02,0.01,0.42,0.96000000000000008,3.21]
["01e_S","2016-02-01","CZK","3 ",0,85,0,30,999999,999999999,2.6900000000000004,0.3,0.3,0.5,0.1,null,null,null,null,0.38,0.02,0.03,0.43000000000000005,0.46,1.8]
["01e_S","2016-02-01","CZK","3 ",85,90,0,30,999999,999999999,4.1899999999999995,0.3,0.3,0.5,0.1,null,null,null,null,0.38,0.02,0.03,0.43000000000000005,0.96000000000000008,2.8]
["01e_S","2016-02-01","CZK","3 ",90,100,0,30,999999,999999999,4.1899999999999995,0.3,0.3,0.5,0.1,null,null,null,null,0.38,0.02,0.03,0.43000000000000005,0.96000000000000008,2.8]
["01e_S","2016-02-01","CZK","5 ",0,85,0,30,999999,999999999,2.6900000000000004,0.3,0.3,0.5,0.1,null,null,null,null,0.45999999999999996,0.02,0.09,0.56999999999999995,0.46,1.6600000000000001]
["01e_S","2016-02-01","CZK","5 ",85,90,0,30,999999,999999999,4.1900000000000004,0.3,0.3,0.5,0.1,null,null,null,null,0.45999999999999996,0.02,0.09,0.56999999999999995,0.96000000000000008,2.66]
["01e_S","2016-02-01","CZK","5 ",90,100,0,30,999999,999999999,4.1900000000000004,0.3,0.3,0.5,0.1,null,null,null,null,0.45999999999999996,0.02,0.09,0.56999999999999995,0.96000000000000008,2.66]
["01e_S","2016-02-01","CZK","7 ",0,85,0,30,999999,999999999,3.3899999999999997,0.3,0.3,0.5,0.1,null,null,null,null,0.57999999999999996,0.02,0.31,0.90999999999999992,0.46,2.02]
["01e_S","2016-02-01","CZK","7 ",85,100,0,30,999999,999999999,4.8900000000000006,0.3,0.3,0.5,0.1,null,null,null,null,{"$f":"T39","v":0.57999999999999996},0.02,0.31,0.90999999999999992,0.96000000000000008,3.02]
["01e_S","2016-02-01","CZK","CA",0,85,0,30,999999,999999999,3.39,0.3,null,null,0.1,0.5,null,null,null,0.37,0.38999999999999996,0.09,0.85,0.46,2.08]
["01e_S","2016-02-01","CZK","CA",85,100,0,30,999999,999999999,4.8900000000000006,0.3,null,null,0.1,0.5,null,null,null,0.37,0.38999999999999996,0.09,0.85,0.96000000000000008,3.08]
["02_N","2016-02-01","CZK","Fl",0,85,0,30,999999,999999999,2.9699999999999998,0.3,null,null,0.1,0.5,null,null,null,{"$f":"T160","v":0.26},{"$f":"U160","v":0},{"$f":"V160","v":0.21999999999999997},0.48,{"$f":"X160+0.38","v":0.72},{"$f":"Y160","v":1.77}]
["02_N","2016-02-01","CZK","Fl",85,100,0,30,999999,999999999,4.4700000000000006,0.3,null,null,0.1,0.5,null,null,null,{"$f":"T161","v":0.26},0,0.21999999999999997,0.48,{"$f":"X161+0.38","v":1.2200000000000002},{"$f":"Y161","v":2.77}]
["02_N","2016-02-01","CZK","1 ",0,85,0,30,999999,999999999,5.3199999999999994,0.3,0.3,0.5,0.1,null,null,null,null,0.38999999999999996,0.02,0.01,0.42,0.72,4.18]
["02_N","2016-02-01","CZK","1 ",85,100,0,30,999999,999999999,6.82,0.3,0.3,0.5,0.1,null,null,null,null,0.38999999999999996,0.02,0.01,0.42,1.2200000000000002,5.18]
["02_N","2016-02-01","CZK","10",0,85,0,30,999999,999999999,4.43,0.3,0.3,0.5,0.1,null,null,null,null,0.77,0.02,0.62,1.4100000000000001,0.72,2.2999999999999998]
["02_N","2016-02-01","CZK","10",85,100,0,30,999999,999999999,5.93,0.3,0.3,0.5,0.1,null,null,null,null,0.77,0.02,0.62,1.4100000000000001,1.2200000000000002,3.3]
["02_N","2016-02-01","CZK","2 ",0,85,0,30,999999,999999999,3.2699999999999996,0.3,0.3,0.5,0.1,null,null,null,null,0.38999999999999996,0.02,0.01,0.42,0.72,2.13]
["02_N","2016-02-01","CZK","2 ",85,100,0,30,999999,999999999,4.7699999999999996,0.3,0.3,0.5,0.1,null,null,null,null,0.38999999999999996,0.02,0.01,0.42,1.2200000000000002,3.13]
["02_N","2016-02-01","CZK","3 ",0,85,0,30,999999,999999999,2.87,0.3,0.3,0.5,0.1,null,null,null,null,0.38,0.02,0.03,0.43000000000000005,0.72,1.72]
["02_N","2016-02-01","CZK","3 ",85,100,0,30,999999,999999999,4.37,0.3,0.3,0.5,0.1,null,null,null,null,0.38,0.02,0.03,0.43000000000000005,1.2200000000000002,2.7199999999999998]
["02_N","2016-02-01","CZK","5 ",0,85,0,30,999999,999999999,2.87,0.3,0.3,0.5,0.1,null,null,null,null,0.45999999999999996,0.02,0.09,0.56999999999999995,0.72,1.58]
["02_N","2016-02-01","CZK","5 ",85,100,0,30,999999,999999999,4.37,0.3,0.3,0.5,0.1,null,null,null,null,0.45999999999999996,0.02,0.09,0.56999999999999995,1.2200000000000002,2.58]
["02_N","2016-02-01","CZK","7 ",0,85,0,30,999999,999999999,3.57,0.3,0.3,0.5,0.1,null,null,null,null,0.57999999999999996,0.02,0.31,0.90999999999999992,0.72,1.94]
["02_N","2016-02-01","CZK","7 ",85,100,0,30,999999,999999999,5.07,0.3,0.3,0.5,0.1,null,null,null,null,0.57999999999999996,0.02,0.31,0.90999999999999992,1.2200000000000002,2.94]
["02_N","2016-02-01","CZK","CA",0,85,0,30,999999,999999999,3.57,0.3,null,null,0.1,0.5,null,null,null,0.37,0.38999999999999996,0.09,0.85,0.72,2]
["02_N","2016-02-01","CZK","CA",85,100,0,30,999999,999999999,5.07,0.3,null,null,0.1,0.5,null,null,null,0.37,0.38999999999999996,0.09,0.85,1.2200000000000002,3]
["02_S","2016-02-01","CZK","Fl",0,85,0,30,999999,999999999,2.59,0.3,null,null,0.1,0.5,null,null,null,{"$f":"T22","v":0.26},{"$f":"U22","v":0},0.21999999999999997,0.48,{"$f":"X22","v":0.34},1.77]
["02_S","2016-02-01","CZK","Fl",85,100,0,30,999999,999999999,4.09,0.3,null,null,0.1,0.5,null,null,null,{"$f":"T23","v":0.26},0,0.21999999999999997,0.48,0.84000000000000008,2.77]
["02_S","2016-02-01","CZK","1 ",0,85,0,30,999999,999999999,4.9399999999999995,0.3,0.3,0.5,0.1,null,null,null,null,0.38999999999999996,0.02,0.01,0.42,0.34,4.18]
["02_S","2016-02-01","CZK","1 ",85,100,0,30,999999,999999999,6.4399999999999995,0.3,0.3,0.5,0.1,null,null,null,null,0.38999999999999996,0.02,0.01,0.42,0.84000000000000008,5.18]
["02_S","2016-02-01","CZK","10",0,85,0,30,999999,999999999,4.05,0.3,0.3,0.5,0.1,null,null,null,null,{"$f":"T27","v":0.77},0.02,0.62,1.4100000000000001,{"$f":"X27","v":0.34},{"$f":"Y27","v":2.2999999999999998}]
["02_S","2016-02-01","CZK","10",85,100,0,30,999999,999999999,5.55,0.3,0.3,0.5,0.1,null,null,null,null,0.77,0.02,0.62,1.4100000000000001,{"$f":"X28","v":0.84000000000000008},{"$f":"Y28","v":3.3}]
["02_S","2016-02-01","CZK","2 ",0,85,0,30,999999,999999999,2.8899999999999997,0.3,0.3,0.5,0.1,null,null,null,null,{"$f":"T30","v":0.38999999999999996},0.02,0.01,0.42,{"$f":"X30","v":0.34},2.13]
["02_S","2016-02-01","CZK","2 ",85,100,0,30,999999,999999999,4.3899999999999997,0.3,0.3,0.5,0.1,null,null,null,null,0.38999999999999996,0.02,0.01,0.42,0.84000000000000008,3.13]
["02_S","2016-02-01","CZK","3 ",0,85,0,30,999999,999999999,2.4900000000000002,0.3,0.3,0.5,0.1,null,null,null,null,0.38,0.02,0.03,0.43000000000000005,0.34,1.72]
["02_S","2016-02-01","CZK","3 ",85,100,0,30,999999,999999999,3.9899999999999998,0.3,0.3,0.5,0.1,null,null,null,null,0.38,0.02,0.03,0.43000000000000005,0.84000000000000008,2.7199999999999998]
["02_S","2016-02-01","CZK","5 ",0,85,0,30,999999,999999999,2.4900000000000002,0.3,0.3,0.5,0.1,null,null,null,null,{"$f":"T35","v":0.45999999999999996},0.02,0.09,0.56999999999999995,{"$f":"X35","v":0.34},{"$f":"Y35","v":1.58}]
["02_S","2016-02-01","CZK","5 ",85,100,0,30,999999,999999999,3.99,0.3,0.3,0.5,0.1,null,null,null,null,0.45999999999999996,0.02,0.09,0.56999999999999995,{"$f":"X36","v":0.84000000000000008},{"$f":"Y36","v":2.58}]
["02_S","2016-02-01","CZK","7 ",0,85,0,30,999999,999999999,3.19,0.3,0.3,0.5,0.1,null,null,null,null,{"$f":"T38","v":0.57999999999999996},0.02,0.31,0.90999999999999992,{"$f":"X38","v":0.34},1.94]
["02_S","2016-02-01","CZK","7 ",85,100,0,30,999999,999999999,4.6899999999999995,0.3,0.3,0.5,0.1,null,null,null,null,0.57999999999999996,0.02,0.31,0.90999999999999992,0.84000000000000008,2.94]
["02_S","2016-02-01","CZK","CA",0,85,0,30,999999,999999999,3.19,0.3,0.3,null,0.1,0.5,null,null,null,0.37,0.38999999999999996,0.09,0.85,0.34,2]
["02_S","2016-02-01","CZK","CA",85,100,0,30,999999,999999999,4.6899999999999995,0.3,0.3,null,0.1,0.5,null,null,null,0.37,0.38999999999999996,0.09,0.85,0.84000000000000008,3]
["03_N","2016-02-01","CZK","Fl",0,60,0,99999,999999,999999999,6.2299999999999995,0.3,null,null,0.1,0.5,null,null,null,{"$f":"T192","v":0.26},{"$f":"U192","v":0},{"$f":"V192","v":0.21999999999999997},0.48,{"$f":"X192+0.38","v":0.98},{"$f":"Y192","v":4.7699999999999996}]
["03_N","2016-02-01","CZK","Fl",60,80,0,99999,999999,999999999,6.47,0.3,null,null,0.1,0.5,null,null,null,{"$f":"T193","v":0.26},0,0.21999999999999997,0.48,{"$f":"X193+0.38","v":1.22},{"$f":"Y193","v":4.7699999999999996}]
["03_N","2016-02-01","CZK","1 ",0,60,0,99999,999999,999999999,8.58,0.3,0.3,0.5,0.1,null,null,null,null,0.38999999999999996,0.02,0.01,0.42,0.98,7.18]
["03_N","2016-02-01","CZK","1 ",60,80,0,99999,999999,999999999,8.82,0.3,0.3,0.5,0.1,null,null,null,null,0.38999999999999996,0.02,0.01,0.42,1.22,7.18]
["03_N","2016-02-01","CZK","10",0,60,0,99999,999999,999999999,7.6899999999999995,0.3,0.3,0.5,0.1,null,null,null,null,0.77,0.02,0.62,1.4100000000000001,0.98,5.3]
["03_N","2016-02-01","CZK","10",60,80,0,99999,999999,999999999,7.93,0.3,0.3,0.5,0.1,null,null,null,null,0.77,0.02,0.62,1.4100000000000001,1.22,5.3]
["03_N","2016-02-01","CZK","2 ",0,60,0,99999,999999,999999999,6.5299999999999994,0.3,0.3,0.5,0.1,null,null,null,null,0.38999999999999996,0.02,0.01,0.42,0.98,5.13]
["03_N","2016-02-01","CZK","2 ",60,80,0,99999,999999,999999999,6.77,0.3,0.3,0.5,0.1,null,null,null,null,0.38999999999999996,0.02,0.01,0.42,1.22,5.13]
["03_N","2016-02-01","CZK","3 ",0,60,0,99999,999999,999999999,6.13,0.3,0.3,0.5,0.1,null,null,null,null,0.38,0.02,0.03,0.43000000000000005,0.98,4.72]
["03_N","2016-02-01","CZK","3 ",60,80,0,99999,999999,999999999,6.3699999999999992,0.3,0.3,0.5,0.1,null,null,null,null,0.38,0.02,0.03,0.43000000000000005,1.22,4.72]
["03_N","2016-02-01","CZK","5 ",0,60,0,99999,999999,999999999,6.13,0.3,0.3,0.5,0.1,null,null,null,null,0.45999999999999996,0.02,0.09,0.56999999999999995,0.98,4.58]
["03_N","2016-02-01","CZK","5 ",60,80,0,99999,999999,999999999,6.37,0.3,0.3,0.5,0.1,null,null,null,null,0.45999999999999996,0.02,0.09,0.56999999999999995,1.22,4.58]
["03_N","2016-02-01","CZK","7 ",0,60,0,99999,999999,999999999,6.8299999999999992,0.3,0.3,0.5,0.1,null,null,null,null,0.57999999999999996,0.02,0.31,0.90999999999999992,0.98,4.9399999999999995]
["03_N","2016-02-01","CZK","7 ",60,80,0,99999,999999,999999999,7.0699999999999994,0.3,0.3,0.5,0.1,null,null,null,null,0.57999999999999996,0.02,0.31,0.90999999999999992,1.22,4.9399999999999995]
["03_N","2016-02-01","CZK","CA",0,60,0,99999,999999,999999999,6.83,0.3,null,null,0.1,0.5,null,null,null,0.37,0.38999999999999996,0.09,0.85,0.98,5]
["03_N","2016-02-01","CZK","CA",60,80,0,99999,999999,999999999,7.07,0.3,null,null,0.1,0.5,null,null,null,0.37,0.38999999999999996,0.09,0.85,1.22,5]
["03_S","2016-02-01","CZK","Fl",0,60,0,99999,999999,999999999,5.85,0.3,null,null,0.1,0.5,null,null,null,{"$f":"T22","v":0.26},{"$f":"U22","v":0},{"$f":"V22","v":0.21999999999999997},0.48,0.6,{"$f":"Y22+3","v":4.7699999999999996}]
["03_S","2016-02-01","CZK","Fl",60,80,0,99999,999999,999999999,6.09,0.3,null,null,0.1,0.5,null,null,null,{"$f":"T22","v":0.26},{"$f":"U22","v":0},{"$f":"V22","v":0.21999999999999997},0.48,{"$f":"X192+0.24","v":0.84},{"$f":"Y22+3","v":4.7699999999999996}]
["03_S","2016-02-01","CZK","1 ",0,60,0,99999,999999,999999999,8.1999999999999993,0.3,0.3,0.5,0.1,null,null,null,null,{"$f":"T24","v":0.38999999999999996},{"$f":"U24","v":0.02},{"$f":"V24","v":0.01},0.42,0.6,{"$f":"Y24+3","v":7.18}]
["03_S","2016-02-01","CZK","1 ",60,80,0,99999,999999,999999999,8.44,0.3,0.3,0.5,0.1,null,null,null,null,{"$f":"T24","v":0.38999999999999996},{"$f":"U24","v":0.02},{"$f":"V24","v":0.01},0.42,{"$f":"X194+0.24","v":0.84},{"$f":"Y24+3","v":7.18}]
["03_S","2016-02-01","CZK","10",0,60,0,99999,999999,999999999,7.3100000000000005,0.3,0.3,0.5,0.1,null,null,null,null,{"$f":"T27","v":0.77},{"$f":"U27","v":0.02},{"$f":"V27","v":0.62},1.4100000000000001,0.6,{"$f":"Y27+3","v":5.3}]
["03_S","2016-02-01","CZK","10",60,80,0,99999,999999,999999999,7.55,0.3,0.3,0.5,0.1,null,null,null,null,{"$f":"T27","v":0.77},{"$f":"U27","v":0.02},{"$f":"V27","v":0.62},1.4100000000000001,{"$f":"X196+0.24","v":0.84},{"$f":"Y27+3","v":5.3}]
["03_S","2016-02-01","CZK","2 ",0,60,0,99999,999999,999999999,6.15,0.3,0.3,0.5,0.1,null,null,null,null,{"$f":"T30","v":0.38999999999999996},{"$f":"U30","v":0.02},{"$f":"V30","v":0.01},0.42,0.6,{"$f":"Y30+3","v":5.13}]
["03_S","2016-02-01","CZK","2 ",60,80,0,99999,999999,999999999,6.39,0.3,0.3,0.5,0.1,null,null,null,null,{"$f":"T30","v":0.38999999999999996},{"$f":"U30","v":0.02},{"$f":"V30","v":0.01},0.42,{"$f":"X198+0.24","v":0.84},{"$f":"Y30+3","v":5.13}]
["03_S","2016-02-01","CZK","3 ",0,60,0,99999,999999,999999999,5.75,0.3,0.3,0.5,0.1,null,null,null,null,{"$f":"T32","v":0.38},{"$f":"U32","v":0.02},{"$f":"V32","v":0.03},0.43000000000000005,0.6,{"$f":"Y32+3","v":4.72}]
["03_S","2016-02-01","CZK","3 ",60,80,0,99999,999999,999999999,5.99,0.3,0.3,0.5,0.1,null,null,null,null,{"$f":"T32","v":0.38},{"$f":"U32","v":0.02},{"$f":"V32","v":0.03},0.43000000000000005,{"$f":"X200+0.24","v":0.84},{"$f":"Y32+3","v":4.72}]
["03_S","2016-02-01","CZK","5 ",0,60,0,99999,999999,999999999,5.75,0.3,0.3,0.5,0.1,null,null,null,null,{"$f":"T35","v":0.45999999999999996},{"$f":"U35","v":0.02},{"$f":"V35","v":0.09},0.56999999999999995,0.6,{"$f":"Y35+3","v":4.58}]
["03_S","2016-02-01","CZK","5 ",60,80,0,99999,999999,999999999,5.99,0.3,0.3,0.5,0.1,null,null,null,null,{"$f":"T35","v":0.45999999999999996},{"$f":"U35","v":0.02},{"$f":"V35","v":0.09},0.56999999999999995,{"$f":"X202+0.24","v":0.84},{"$f":"Y35+3","v":4.58}]
["03_S","2016-02-01","CZK","7 ",0,60,0,99999,999999,999999999,6.4499999999999993,0.3,0.3,0.5,0.1,null,null,null,null,{"$f":"T38","v":0.57999999999999996},{"$f":"U38","v":0.02},{"$f":"V38","v":0.31},0.90999999999999992,0.6,{"$f":"Y38+3","v":4.9399999999999995}]
["03_S","2016-02-01","CZK","7 ",60,80,0,99999,999999,999999999,6.6899999999999995,0.3,0.3,0.5,0.1,null,null,null,null,{"$f":"T38","v":0.57999999999999996},{"$f":"U38","v":0.02},{"$f":"V38","v":0.31},0.90999999999999992,{"$f":"X204+0.24","v":0.84},{"$f":"Y38+3","v":4.9399999999999995}]
["03_S","2016-02-01","CZK","CA",0,60,0,99999,999999,999999999,6.45,0.3,null,null,0.1,0.5,null,null,null,{"$f":"T40","v":0.37},{"$f":"U40","v":0.38999999999999996},{"$f":"V40","v":0.09},0.85,0.6,{"$f":"Y40+3","v":5}]
["03_S","2016-02-01","CZK","CA",60,80,0,99999,999999,999999999,6.6899999999999995,0.3,null,null,0.1,0.5,null,null,null,{"$f":"T40","v":0.37},{"$f":"U40","v":0.38999999999999996},{"$f":"V40","v":0.09},0.85,{"$f":"X206+0.24","v":0.84},{"$f":"Y40+3","v":5}]
["01a_N","2016-02-01","CZK","Fl",0,85,0,30,0,1000000,3.17,0.3,null,null,0.1,0.5,null,null,null,{"$f":"T2","v":0.26},0,0.21999999999999997,0.48,{"$f":"X2","v":0.72},{"$f":"Y2+0.2","v":1.97}]
["01a_N","2016-02-01","CZK","Fl",85,100,0,30,0,1000000,4.67,0.3,null,null,0.1,0.5,null,null,null,0.26,0,0.21999999999999997,0.48,1.2200000000000002,2.97]
["01a_N","2016-02-01","CZK","1 ",0,85,0,30,0,1000000,5.52,0.3,0.3,0.5,0.1,null,null,null,null,0.38999999999999996,0.02,0.01,0.42,0.72,4.38]
["01a_N","2016-02-01","CZK","1 ",90,100,0,30,0,1000000,{"$f":"T211+U211+V211+X211+Y211","v":7.02},0.3,0.3,0.5,0.1,null,null,null,null,0.38999999999999996,0.02,0.01,{"$f":"T211+U211+V211","v":0.42},1.2200000000000002,5.38]
["01a_N",{"$f":"$B$2","v":"2016-02-01"},"CZK","1 ",85,90,0,30,0,1000000,7.02,0.3,0.3,0.5,0.1,null,null,null,null,0.38999999999999996,0.02,0.01,0.42,1.2200000000000002,5.38]
["01a_N","2016-02-01","CZK","10",0,85,0,30,0,1000000,4.63,0.3,0.3,0.5,0.1,null,null,null,null,0.77,0.02,0.62,1.4100000000000001,0.72,2.5]
["01a_N","2016-02-01","CZK","10",90,100,0,30,0,1000000,6.1300000000000008,0.3,0.3,0.5,0.1,null,null,null,null,0.77,0.02,0.62,1.4100000000000001,1.2200000000000002,3.5]
["01a_N","2016-02-01","CZK","10",85,90,0,30,0,1000000,6.1300000000000008,0.3,0.3,0.5,0.1,null,null,null,null,0.77,0.02,0.62,1.4100000000000001,1.2200000000000002,3.5]
["01a_N","2016-02-01","CZK","2 ",0,85,0,30,0,1000000,3.4699999999999998,0.3,0.3,0.5,0.1,null,null,null,null,0.38999999999999996,0.02,0.01,0.42,0.72,2.33]
["01a_N","2016-02-01","CZK","2 ",85,100,0,30,0,1000000,4.9700000000000006,0.3,0.3,0.5,0.1,null,null,null,null,0.38999999999999996,0.02,0.01,0.42,1.2200000000000002,3.33]
["01a_N","2016-02-01","CZK","3 ",0,85,0,30,0,1000000,3.07,0.3,0.3,0.5,0.1,null,null,null,null,0.38,0.02,0.03,0.43000000000000005,0.72,1.92]
["01a_N","2016-02-01","CZK","3 ",90,100,0,30,0,1000000,4.57,0.3,0.3,0.5,0.1,null,null,null,null,0.38,0.02,0.03,0.43000000000000005,1.2200000000000002,2.92]
["01a_N","2016-02-01","CZK","3 ",85,90,0,30,0,1000000,4.57,0.3,0.3,0.5,0.1,null,null,null,null,0.38,0.02,0.03,0.43000000000000005,1.2200000000000002,2.92]
["01a_N","2016-02-01","CZK","5 ",0,85,0,30,0,1000000,3.0700000000000003,0.3,0.3,0.5,0.1,null,null,null,null,0.45999999999999996,0.02,0.09,0.56999999999999995,0.72,1.78]
["01a_N","2016-02-01","CZK","5 ",85,90,0,30,0,1000000,4.57,0.3,0.3,0.5,0.1,null,null,null,null,0.45999999999999996,0.02,0.09,0.56999999999999995,1.2200000000000002,2.7800000000000002]
["01a_N","2016-02-01","CZK","5 ",90,100,0,30,0,1000000,4.57,0.3,0.3,0.5,0.1,null,null,null,null,0.45999999999999996,0.02,0.09,0.56999999999999995,1.2200000000000002,2.7800000000000002]
["01a_N","2016-02-01","CZK","7 ",0,85,0,30,0,1000000,3.77,0.3,0.3,0.5,0.1,null,null,null,null,0.57999999999999996,0.02,0.31,0.90999999999999992,0.72,2.14]
["01a_N","2016-02-01","CZK","7 ",85,100,0,30,0,1000000,5.27,0.3,0.3,0.5,0.1,null,null,null,null,0.57999999999999996,0.02,0.31,0.90999999999999992,1.2200000000000002,3.14]
["01a_N","2016-02-01","CZK","CA",0,85,0,30,0,1000000,3.77,0.3,null,null,0.1,0.5,null,null,null,0.37,0.38999999999999996,0.09,0.85,0.72,2.2000000000000002]
["01a_N","2016-02-01","CZK","CA",85,100,0,30,0,1000000,5.2700000000000005,0.3,null,null,0.1,0.5,null,null,null,0.37,0.38999999999999996,0.09,0.85,1.2200000000000002,3.2]
["01a_S","2016-02-01","CZK","Fl",0,85,0,30,0,1000000,2.79,0.3,null,null,0.1,0.5,null,null,null,{"$f":"T22","v":0.26},0,0.21999999999999997,0.48,0.34,1.97]
["01a_S","2016-02-01","CZK","Fl",85,100,0,30,0,1000000,4.29,0.3,null,null,0.1,0.5,null,null,null,0.26,0,0.21999999999999997,0.48,0.84000000000000008,2.97]
["01a_S","2016-02-01","CZK","1 ",0,85,0,30,0,1000000,5.14,0.3,0.3,0.5,0.1,null,null,null,null,0.38999999999999996,0.02,0.01,0.42,0.34,4.38]
["01a_S","2016-02-01","CZK","1 ",90,100,0,30,0,1000000,6.64,0.3,0.3,0.5,0.1,null,null,null,null,0.38999999999999996,0.02,0.01,0.42,0.84000000000000008,5.38]
["01a_S","2016-02-01","CZK","1 ",85,90,0,30,0,1000000,6.64,0.3,0.3,0.5,0.1,null,null,null,null,0.38999999999999996,0.02,0.01,0.42,0.84000000000000008,5.38]
["01a_S","2016-02-01","CZK","10",0,85,0,30,0,1000000,4.25,0.3,0.3,0.5,0.1,null,null,null,null,0.77,0.02,0.62,1.4100000000000001,0.34,2.5]
["01a_S","2016-02-01","CZK","10",90,100,0,30,0,1000000,5.75,0.3,0.3,0.5,0.1,null,null,null,null,0.77,0.02,0.62,1.4100000000000001,0.84000000000000008,3.5]
["01a_S","2016-02-01","CZK","10",85,90,0,30,0,1000000,5.75,0.3,0.3,0.5,0.1,null,null,null,null,0.77,0.02,0.62,1.4100000000000001,0.84000000000000008,3.5]
["01a_S","2016-02-01","CZK","2 ",0,85,0,30,0,1000000,3.09,0.3,0.3,0.5,0.1,null,null,null,null,0.38999999999999996,0.02,0.01,0.42,0.34,2.33]
["01a_S","2016-02-01","CZK","2 ",85,100,0,30,0,1000000,4.59,0.3,0.3,0.5,0.1,null,null,null,null,0.38999999999999996,0.02,0.01,0.42,0.84000000000000008,3.33]
["01a_S","2016-02-01","CZK","3 ",0,85,0,30,0,1000000,2.69,0.3,0.3,0.5,0.1,null,null,null,null,0.38,0.02,0.03,0.43000000000000005,0.34,1.92]
["01a_S","2016-02-01","CZK","3 ",90,100,0,30,0,1000000,4.1899999999999995,0.3,0.3,0.5,0.1,null,null,null,null,0.38,0.02,0.03,0.43000000000000005,0.84000000000000008,2.92]
["01a_S","2016-02-01","CZK","3 ",85,90,0,30,0,1000000,4.1899999999999995,0.3,0.3,0.5,0.1,null,null,null,null,0.38,0.02,0.03,0.43000000000000005,{"$f":"X34","v":0.84000000000000008},{"$f":"Y34+0.2","v":2.92}]
["01a_S","2016-02-01","CZK","5 ",0,85,0,30,0,1000000,2.69,0.3,0.3,0.5,0.1,null,null,null,null,0.45999999999999996,0.02,0.09,0.56999999999999995,0.34,1.78]
["01a_S","2016-02-01","CZK","5 ",85,90,0,30,0,1000000,4.1900000000000004,0.3,0.3,0.5,0.1,null,null,null,null,0.45999999999999996,0.02,0.09,0.56999999999999995,0.84000000000000008,2.7800000000000002]
["01a_S","2016-02-01","CZK","5 ",90,100,0,30,0,1000000,4.1900000000000004,0.3,0.3,0.5,0.1,null,null,null,null,0.45999999999999996,0.02,0.09,0.56999999999999995,0.84000000000000008,2.7800000000000002]
["01a_S","2016-02-01","CZK","7 ",0,85,0,30,0,1000000,3.39,0.3,0.3,0.5,0.1,null,null,null,null,0.57999999999999996,0.02,0.31,0.90999999999999992,0.34,2.14]
["01a_S","2016-02-01","CZK","7 ",85,100,0,30,0,1000000,4.8900000000000006,0.3,0.3,0.5,0.1,null,null,null,null,0.57999999999999996,0.02,0.31,0.90999999999999992,0.84000000000000008,3.14]
["01a_S","2016-02-01","CZK","CA",0,85,0,30,0,1000000,3.39,0.3,null,null,0.1,0.5,null,null,null,0.37,0.38999999999999996,0.09,0.85,0.34,2.2000000000000002]
["01a_S","2016-02-01","CZK","CA",85,100,0,30,0,1000000,4.8900000000000006,0.3,null,null,0.1,0.5,null,null,null,0.37,0.38999999999999996,0.09,0.85,0.84000000000000008,3.2]
["01c_N","2016-02-01","CZK","1 ",0,85,0,30,0,1000000,6.02,0.3,0.3,0.5,0.1,null,null,null,null,{"$f":"T42","v":0.38999999999999996},0.3,0.01,0.7,0.72,4.5999999999999996]
["01c_N","2016-02-01","CZK","1 ",90,100,0,30,0,1000000,7.52,0.3,0.3,0.5,0.1,null,null,null,null,0.38999999999999996,0.3,0.01,0.7,1.2200000000000002,5.6]
["01c_N","2016-02-01","CZK","1 ",85,90,0,30,0,1000000,7.52,0.3,0.3,0.5,0.1,null,null,null,null,0.38999999999999996,0.3,0.01,0.7,1.2200000000000002,5.6]
["01c_N","2016-02-01","CZK","10",0,85,0,30,0,1000000,5.1300000000000008,0.3,0.3,0.5,0.1,null,null,null,null,0.77,0.3,0.62,1.69,0.72,2.72]
["01c_N","2016-02-01","CZK","10",85,90,0,30,0,1000000,6.6300000000000008,0.3,0.3,0.5,0.1,null,null,null,null,0.77,0.3,0.62,1.69,1.2200000000000002,3.72]
["01c_N","2016-02-01","CZK","10",90,100,0,30,0,1000000,6.6300000000000008,0.3,0.3,0.5,0.1,null,null,null,null,0.77,0.3,0.62,1.69,1.2200000000000002,3.72]
["01c_N","2016-02-01","CZK","2 ",0,85,0,30,0,1000000,3.97,0.3,0.3,0.5,0.1,null,null,null,null,0.38999999999999996,0.3,0.01,0.7,0.72,2.5500000000000003]
["01c_N","2016-02-01","CZK","2 ",85,100,0,30,0,1000000,5.4700000000000006,0.3,0.3,0.5,0.1,null,null,null,null,0.38999999999999996,0.3,0.01,0.7,1.2200000000000002,3.5500000000000003]
["01c_N","2016-02-01","CZK","3 ",0,85,0,30,0,1000000,3.5700000000000003,0.3,0.3,0.5,0.1,null,null,null,null,0.38,0.3,0.03,0.71,0.72,2.14]
["01c_N","2016-02-01","CZK","3 ",90,100,0,30,0,1000000,5.07,0.3,0.3,0.5,0.1,null,null,null,null,0.38,0.3,0.03,0.71,1.2200000000000002,3.14]
["01c_N","2016-02-01","CZK","3 ",85,90,0,30,0,1000000,5.07,0.3,0.3,0.5,0.1,null,null,null,null,0.38,0.3,0.03,0.71,1.2200000000000002,3.14]
["01c_N","2016-02-01","CZK","5 ",0,85,0,30,0,1000000,3.57,0.3,0.3,0.5,0.1,null,null,null,null,0.45999999999999996,0.3,0.09,0.85,0.72,2]
["01c_N","2016-02-01","CZK","5 ",85,90,0,30,0,1000000,5.07,0.3,0.3,0.5,0.1,null,null,null,null,0.45999999999999996,0.3,0.09,0.85,1.2200000000000002,3.0000000000000004]
["01c_N","2016-02-01","CZK","5 ",90,100,0,30,0,1000000,5.07,0.3,0.3,0.5,0.1,null,null,null,null,0.45999999999999996,0.3,0.09,0.85,1.2200000000000002,3.0000000000000004]
["01c_N","2016-02-01","CZK","7 ",0,85,0,30,0,1000000,4.2700000000000005,0.3,0.3,0.5,0.1,null,null,null,null,0.57999999999999996,0.3,0.31,1.19,0.72,2.3600000000000003]
["01c_N","2016-02-01","CZK","7 ",85,100,0,30,0,1000000,5.7700000000000005,0.3,0.3,0.5,0.1,null,null,null,null,0.57999999999999996,0.3,0.31,1.19,1.2200000000000002,3.3600000000000003]
["01c_S","2016-02-01","CZK","1 ",0,85,0,30,0,1000000,5.64,0.3,0.3,0.5,0.1,null,null,null,null,0.38999999999999996,0.3,0.01,0.7,0.34,4.5999999999999996]
["01c_S","2016-02-01","CZK","1 ",90,100,0,30,0,1000000,7.14,0.3,0.3,0.5,0.1,null,null,null,null,0.38999999999999996,0.3,0.01,0.7,0.84000000000000008,5.6]
["01c_S","2016-02-01","CZK","1 ",85,90,0,30,0,1000000,7.14,0.3,0.3,0.5,0.1,null,null,null,null,0.38999999999999996,0.3,0.01,0.7,0.84000000000000008,5.6]
["01c_S","2016-02-01","CZK","10",0,85,0,30,0,1000000,4.75,0.3,0.3,0.5,0.1,null,null,null,null,0.77,0.3,0.62,1.69,0.34,2.72]
["01c_S","2016-02-01","CZK","10",85,90,0,30,0,1000000,6.25,0.3,0.3,0.5,0.1,null,null,null,null,{"$f":"T62","v":0.77},0.3,0.62,1.69,0.84000000000000008,3.72]
["01c_S","2016-02-01","CZK","10",90,100,0,30,0,1000000,6.25,0.3,0.3,0.5,0.1,null,null,null,null,0.77,0.3,0.62,1.69,0.84000000000000008,3.72]
["01c_S","2016-02-01","CZK","2 ",0,85,0,30,0,1000000,3.5900000000000003,0.3,0.3,0.5,0.1,null,null,null,null,0.38999999999999996,0.3,0.01,0.7,0.34,2.5500000000000003]
["01c_S","2016-02-01","CZK","2 ",85,100,0,30,0,1000000,5.09,0.3,0.3,0.5,0.1,null,null,null,null,0.38999999999999996,0.3,0.01,0.7,0.84000000000000008,3.5500000000000003]
["01c_S","2016-02-01","CZK","3 ",0,85,0,30,0,1000000,3.1900000000000004,0.3,0.3,0.5,0.1,null,null,null,null,0.38,0.3,0.03,0.71,{"$f":"X66","v":0.34},{"$f":"Y66+0.2","v":2.14}]
["01c_S","2016-02-01","CZK","3 ",90,100,0,30,0,1000000,4.6900000000000004,0.3,0.3,0.5,0.1,null,null,null,null,0.38,0.3,0.03,0.71,0.84000000000000008,3.14]
["01c_S","2016-02-01","CZK","3 ",85,90,0,30,0,1000000,4.6900000000000004,0.3,0.3,0.5,0.1,null,null,null,null,0.38,0.3,0.03,0.71,0.84000000000000008,3.14]
["01c_S","2016-02-01","CZK","5 ",0,85,0,30,0,1000000,{"$f":"T275+U275+V275+X275+Y275","v":3.19},0.3,0.3,0.5,0.1,null,null,null,null,0.45999999999999996,0.3,0.09,{"$f":"T275+U275+V275","v":0.85},0.34,2]
["01c_S",{"$f":"$B$2","v":"2016-02-01"},"CZK","5 ",85,90,0,30,0,1000000,4.6900000000000004,0.3,0.3,0.5,0.1,null,null,null,null,0.45999999999999996,0.3,0.09,0.85,0.84000000000000008,3.0000000000000004]
["01c_S","2016-02-01","CZK","5 ",90,100,0,30,0,1000000,4.6900000000000004,0.3,0.3,0.5,0.1,null,null,null,null,0.45999999999999996,0.3,0.09,0.85,0.84000000000000008,3.0000000000000004]
["01c_S","2016-02-01","CZK","7 ",0,85,0,30,0,1000000,3.8900000000000006,0.3,0.3,0.5,0.1,null,null,null,null,0.57999999999999996,0.3,0.31,1.19,0.34,2.3600000000000003]
["01c_S","2016-02-01","CZK","7 ",85,100,0,30,0,1000000,5.3900000000000006,0.3,0.3,0.5,0.1,null,null,null,null,0.57999999999999996,0.3,0.31,1.19,0.84000000000000008,3.3600000000000003]
["01d_N","2016-02-01","CZK","Fl",0,85,0,30,0,1000000,17.2,0.3,null,null,0.1,0.5,null,null,null,1,2,3,6,5,6.2]
["01d_N","2016-02-01","CZK","Fl",85,100,0,30,0,1000000,17.2,0.3,null,null,0.1,0.5,null,null,null,1,2,3,6,5,6.2]
["01d_N","2016-02-01","CZK","10",0,85,0,30,0,1000000,17.2,0.3,0.3,0.5,0.1,null,null,null,null,1,2,3,6,5,6.2]
["01d_N","2016-02-01","CZK","10",85,90,0,30,0,1000000,17.2,0.3,0.3,0.5,0.1,null,null,null,null,1,2,3,6,5,6.2]
["01d_N","2016-02-01","CZK","10",90,100,0,30,0,1000000,17.2,0.3,0.3,0.5,0.1,null,null,null,null,1,2,3,6,5,6.2]
["01d_N","2016-02-01","CZK","3 ",0,85,0,30,0,1000000,17.2,0.3,0.3,0.5,0.1,null,null,null,null,1,2,3,6,5,6.2]
["01d_N","2016-02-01","CZK","3 ",90,100,0,30,0,1000000,17.2,0.3,0.3,0.5,0.1,null,null,null,null,1,2,3,6,5,6.2]
["01d_N","2016-02-01","CZK","3 ",85,90,0,30,0,1000000,17.2,0.3,0.3,0.5,0.1,null,null,null,null,1,2,3,6,5,6.2]
["01d_N","2016-02-01","CZK","5 ",0,85,0,30,0,1000000,17.2,0.3,0.3,0.5,0.1,null,null,null,null,{"$f":"T82","v":1},2,3,6,5,6.2]
["01d_N","2016-02-01","CZK","5 ",85,90,0,30,0,1000000,17.2,0.3,0.3,0.5,0.1,null,null,null,null,1,2,3,6,5,6.2]
["01d_N","2016-02-01","CZK","5 ",90,100,0,30,0,1000000,17.2,0.3,0.3,0.5,0.1,null,null,null,null,1,2,3,6,5,6.2]
["01d_N","2016-02-01","CZK","7 ",0,85,0,30,0,1000000,17.2,0.3,null,null,0.1,0.5,null,null,null,1,2,3,6,5,6.2]
["01d_N","2016-02-01","CZK","7 ",85,100,0,30,0,1000000,17.2,0.3,null,null,0.1,0.5,null,null,null,1,2,3,6,5,6.2]
["01d_N","2016-02-01","CZK","CA",0,85,0,30,0,1000000,17.2,0.3,null,null,0.1,0.5,null,null,null,1,2,3,6,5,6.2]
["01d_N","2016-02-01","CZK","CA",85,100,0,30,0,1000000,17.2,0.3,null,null,0.1,0.5,null,null,null,1,2,3,6,5,6.2]
["01d_S","2016-02-01","CZK","Fl",0,85,0,30,0,1000000,17.2,0.3,null,null,0.1,0.5,null,null,null,1,2,3,6,5,6.2]
["01d_S","2016-02-01","CZK","Fl",85,100,0,30,0,1000000,17.2,0.3,null,null,0.1,0.5,null,null,null,1,2,3,6,5,6.2]
["01d_S","2016-02-01","CZK","10",0,85,0,30,0,1000000,17.2,0.3,0.3,0.5,0.1,null,null,null,null,1,2,3,6,5,6.2]
["01d_S","2016-02-01","CZK","10",85,90,0,30,0,1000000,17.2,0.3,0.3,0.5,0.1,null,null,null,null,1,2,3,6,5,6.2]
["01d_S","2016-02-01","CZK","10",90,100,0,30,0,1000000,17.2,0.3,0.3,0.5,0.1,null,null,null,null,1,2,3,6,5,6.2]
["01d_S","2016-02-01","CZK","3 ",0,85,0,30,0,1000000,17.2,0.3,0.3,0.5,0.1,null,null,null,null,1,2,3,6,5,6.2]
["01d_S","2016-02-01","CZK","3 ",90,100,0,30,0,1000000,17.2,0.3,0.3,0.5,0.1,null,null,null,null,1,2,3,6,5,6.2]
["01d_S","2016-02-01","CZK","3 ",85,90,0,30,0,1000000,17.2,0.3,0.3,0.5,0.1,null,null,null,null,1,2,3,6,5,6.2]
["01d_S","2016-02-01","CZK","5 ",0,85,0,30,0,1000000,17.2,0.3,0.3,0.5,0.1,null,null,null,null,1,2,3,6,5,6.2]
["01d_S","2016-02-01","CZK","5 ",85,90,0,30,0,1000000,17.2,0.3,0.3,0.5,0.1,null,null,null,null,1,2,3,6,{"$f":"X98","v":5},{"$f":"Y98+0.2","v":6.2}]
["01d_S","2016-02-01","CZK","5 ",90,100,0,30,0,1000000,17.2,0.3,0.3,0.5,0.1,null,null,null,null,1,2,3,6,5,6.2]
["01d_S","2016-02-01","CZK","7 ",0,85,0,30,0,1000000,17.2,0.3,null,null,0.1,0.5,null,null,null,1,2,3,6,5,6.2]
["01d_S","2016-02-01","CZK","7 ",85,100,0,30,0,1000000,17.2,0.3,null,null,0.1,0.5,null,null,null,1,2,3,6,5,6.2]
["01d_S","2016-02-01","CZK","CA",0,85,0,30,0,1000000,17.2,0.3,null,null,0.1,0.5,null,null,null,{"$f":"T102","v":1},2,3,6,5,6.2]
["01d_S","2016-02-01","CZK","CA",85,100,0,30,0,1000000,17.2,0.3,null,null,0.1,0.5,null,null,null,1,2,3,6,5,6.2]
["01e_N","2016-02-01","CZK","Fl",0,85,0,30,0,1000000,3.37,0.3,null,null,0.1,0.5,null,null,null,0.26,0,0.21999999999999997,0.48,0.84000000000000008,2.0500000000000003]
["01e_N","2016-02-01","CZK","Fl",85,100,0,30,0,1000000,4.87,0.3,null,null,0.1,0.5,null,null,null,0.26,0,0.21999999999999997,0.48,1.34,3.0500000000000003]
["01e_N","2016-02-01","CZK","1 ",0,85,0,30,0,1000000,5.72,0.3,0.3,0.5,0.1,null,null,null,null,0.38999999999999996,0.02,0.01,0.42,0.84000000000000008,4.46]
["01e_N","2016-02-01","CZK","1 ",85,90,0,30,0,1000000,7.22,0.3,0.3,0.5,0.1,null,null,null,null,0.38999999999999996,0.02,0.01,0.42,1.34,5.46]
["01e_N","2016-02-01","CZK","1 ",90,100,0,30,0,1000000,7.22,0.3,0.3,0.5,0.1,null,null,null,null,0.38999999999999996,0.02,0.01,0.42,1.34,5.46]
["01e_N","2016-02-01","CZK","10",0,85,0,30,0,1000000,4.83,0.3,0.3,0.5,0.1,null,null,null,null,0.77,0.02,0.62,1.4100000000000001,0.84000000000000008,2.58]
["01e_N","2016-02-01","CZK","10",85,90,0,30,0,1000000,6.33,0.3,0.3,0.5,0.1,null,null,null,null,0.77,0.02,0.62,1.4100000000000001,1.34,3.58]
["01e_N","2016-02-01","CZK","10",90,100,0,30,0,1000000,6.33,0.3,0.3,0.5,0.1,null,null,null,null,0.77,0.02,0.62,1.4100000000000001,1.34,3.58]
["01e_N","2016-02-01","CZK","2 ",0,85,0,30,0,1000000,3.67,0.3,0.3,0.5,0.1,null,null,null,null,0.38999999999999996,0.02,0.01,0.42,0.84000000000000008,2.41]
["01e_N","2016-02-01","CZK","2 ",85,100,0,30,0,1000000,5.17,0.3,0.3,0.5,0.1,null,null,null,null,0.38999999999999996,0.02,0.01,0.42,1.34,3.41]
["01e_N","2016-02-01","CZK","3 ",0,85,0,30,0,1000000,3.27,0.3,0.3,0.5,0.1,null,null,null,null,0.38,0.02,0.03,0.43000000000000005,0.84000000000000008,2]
["01e_N","2016-02-01","CZK","3 ",85,90,0,30,0,1000000,4.7699999999999996,0.3,0.3,0.5,0.1,null,null,null,null,0.38,0.02,0.03,0.43000000000000005,1.34,3]
["01e_N","2016-02-01","CZK","3 ",90,100,0,30,0,1000000,4.7699999999999996,0.3,0.3,0.5,0.1,null,null,null,null,0.38,0.02,0.03,0.43000000000000005,1.34,3]
["01e_N","2016-02-01","CZK","5 ",0,85,0,30,0,1000000,3.2700000000000005,0.3,0.3,0.5,0.1,null,null,null,null,0.45999999999999996,0.02,0.09,0.56999999999999995,0.84000000000000008,1.86]
["01e_N","2016-02-01","CZK","5 ",85,90,0,30,0,1000000,4.7700000000000005,0.3,0.3,0.5,0.1,null,null,null,null,0.45999999999999996,0.02,0.09,0.56999999999999995,1.34,2.8600000000000003]
["01e_N","2016-02-01","CZK","5 ",90,100,0,30,0,1000000,4.7700000000000005,0.3,0.3,0.5,0.1,null,null,null,null,0.45999999999999996,0.02,0.09,0.56999999999999995,1.34,2.8600000000000003]
["01e_N","2016-02-01","CZK","7 ",0,85,0,30,0,1000000,3.97,0.3,0.3,0.5,0.1,null,null,null,null,0.57999999999999996,0.02,0.31,0.90999999999999992,0.84000000000000008,2.2200000000000002]
["01e_N","2016-02-01","CZK","7 ",85,100,0,30,0,1000000,5.4700000000000006,0.3,0.3,0.5,0.1,null,null,null,null,0.57999999999999996,0.02,0.31,0.90999999999999992,1.34,3.22]
["01e_N","2016-02-01","CZK","CA",0,85,0,30,0,1000000,3.97,0.3,null,null,0.1,0.5,null,null,null,{"$f":"T122","v":0.37},0.38999999999999996,0.09,0.85,0.84000000000000008,2.2800000000000002]
["01e_N","2016-02-01","CZK","CA",85,100,0,30,0,1000000,5.4700000000000006,0.3,null,null,0.1,0.5,null,null,null,0.37,0.38999999999999996,0.09,0.85,1.34,3.2800000000000002]
["01e_S","2016-02-01","CZK","Fl",0,85,0,30,0,1000000,2.99,0.3,null,null,0.1,0.5,null,null,null,0.26,0,0.21999999999999997,0.48,0.46,2.0500000000000003]
["01e_S","2016-02-01","CZK","Fl",85,100,0,30,0,1000000,4.49,0.3,null,null,0.1,0.5,null,null,null,0.26,0,0.21999999999999997,0.48,0.96000000000000008,3.0500000000000003]
["01e_S","2016-02-01","CZK","1 ",0,85,0,30,0,1000000,5.34,0.3,0.3,0.5,0.1,null,null,null,null,0.38999999999999996,0.02,0.01,0.42,0.46,4.46]
["01e_S","2016-02-01","CZK","1 ",85,90,0,30,0,1000000,6.84,0.3,0.3,0.5,0.1,null,null,null,null,0.38999999999999996,0.02,0.01,0.42,0.96000000000000008,5.46]
["01e_S","2016-02-01","CZK","1 ",90,100,0,30,0,1000000,6.84,0.3,0.3,0.5,0.1,null,null,null,null,0.38999999999999996,0.02,0.01,0.42,0.96000000000000008,5.46]
["01e_S","2016-02-01","CZK","10",0,85,0,30,0,1000000,4.45,0.3,0.3,0.5,0.1,null,null,null,null,0.77,0.02,0.62,1.4100000000000001,0.46,2.58]
["01e_S","2016-02-01","CZK","10",85,90,0,30,0,1000000,5.95,0.3,0.3,0.5,0.1,null,null,null,null,0.77,0.02,0.62,1.4100000000000001,{"$f":"X130","v":0.96000000000000008},{"$f":"Y130+0.2","v":3.58}]
["01e_S","2016-02-01","CZK","10",90,100,0,30,0,1000000,5.95,0.3,0.3,0.5,0.1,null,null,null,null,0.77,0.02,0.62,1.4100000000000001,0.96000000000000008,3.58]
["01e_S","2016-02-01","CZK","2 ",0,85,0,30,0,1000000,3.29,0.3,0.3,0.5,0.1,null,null,null,null,0.38999999999999996,0.02,0.01,0.42,0.46,2.41]
["01e_S","2016-02-01","CZK","2 ",85,100,0,30,0,1000000,{"$f":"T339+U339+V339+X339+Y339","v":4.79},0.3,0.3,0.5,0.1,null,null,null,null,0.38999999999999996,0.02,0.01,{"$f":"T339+U339+V339","v":0.42},0.96000000000000008,3.41]
["01e_S",{"$f":"$B$2","v":"2016-02-01"},"CZK","3 ",0,85,0,30,0,1000000,2.89,0.3,0.3,0.5,0.1,null,null,null,null,0.38,0.02,0.03,0.43000000000000005,0.46,2]
["01e_S","2016-02-01","CZK","3 ",85,90,0,30,0,1000000,4.3900000000000006,0.3,0.3,0.5,0.1,null,null,null,null,0.38,0.02,0.03,0.43000000000000005,0.96000000000000008,3]
["01e_S","2016-02-01","CZK","3 ",90,100,0,30,0,1000000,4.3900000000000006,0.3,0.3,0.5,0.1,null,null,null,null,0.38,0.02,0.03,0.43000000000000005,0.96000000000000008,3]
["01e_S","2016-02-01","CZK","5 ",0,85,0,30,0,1000000,2.89,0.3,0.3,0.5,0.1,null,null,null,null,0.45999999999999996,0.02,0.09,0.56999999999999995,0.46,1.86]
["01e_S","2016-02-01","CZK","5 ",85,90,0,30,0,1000000,4.3900000000000006,0.3,0.3,0.5,0.1,null,null,null,null,0.45999999999999996,0.02,0.09,0.56999999999999995,0.96000000000000008,2.8600000000000003]
["01e_S","2016-02-01","CZK","5 ",90,100,0,30,0,1000000,4.3900000000000006,0.3,0.3,0.5,0.1,null,null,null,null,0.45999999999999996,0.02,0.09,0.56999999999999995,0.96000000000000008,2.8600000000000003]
["01e_S","2016-02-01","CZK","7 ",0,85,0,30,0,1000000,3.59,0.3,0.3,0.5,0.1,null,null,null,null,0.57999999999999996,0.02,0.31,0.90999999999999992,0.46,2.2200000000000002]
["01e_S","2016-02-01","CZK","7 ",85,100,0,30,0,1000000,5.09,0.3,0.3,0.5,0.1,null,null,null,null,0.57999999999999996,0.02,0.31,0.90999999999999992,0.96000000000000008,3.22]
["01e_S","2016-02-01","CZK","CA",0,85,0,30,0,1000000,3.5900000000000003,0.3,null,null,0.1,0.5,null,null,null,{"$f":"T142","v":0.37},0.38999999999999996,0.09,0.85,0.46,2.2800000000000002]
["01e_S","2016-02-01","CZK","CA",85,100,0,30,0,1000000,5.09,0.3,null,null,0.1,0.5,null,null,null,0.37,0.38999999999999996,0.09,0.85,0.96000000000000008,3.2800000000000002]
["02_N","2016-02-01","CZK","Fl",0,85,0,30,0,1000000,3.17,0.3,null,null,0.1,0.5,null,null,null,0.26,0,0.21999999999999997,0.48,0.72,1.97]
["02_N","2016-02-01","CZK","Fl",85,100,0,30,0,1000000,4.67,0.3,null,null,0.1,0.5,null,null,null,0.26,0,0.21999999999999997,0.48,1.2200000000000002,2.97]
["02_N","2016-02-01","CZK","1 ",0,85,0,30,0,1000000,5.52,0.3,0.3,0.5,0.1,null,null,null,null,{"$f":"T146","v":0.38999999999999996},0.02,0.01,0.42,{"$f":"X146","v":0.72},4.38]
["02_N","2016-02-01","CZK","1 ",85,100,0,30,0,1000000,7.02,0.3,0.3,0.5,0.1,null,null,null,null,0.38999999999999996,0.02,0.01,0.42,1.2200000000000002,5.38]
["02_N","2016-02-01","CZK","10",0,85,0,30,0,1000000,4.63,0.3,0.3,0.5,0.1,null,null,null,null,0.77,0.02,0.62,1.4100000000000001,0.72,2.5]
["02_N","2016-02-01","CZK","10",85,100,0,30,0,1000000,6.1300000000000008,0.3,0.3,0.5,0.1,null,null,null,null,0.77,0.02,0.62,1.4100000000000001,1.2200000000000002,3.5]
["02_N","2016-02-01","CZK","2 ",0,85,0,30,0,1000000,3.4699999999999998,0.3,0.3,0.5,0.1,null,null,null,null,0.38999999999999996,0.02,0.01,0.42,0.72,2.33]
["02_N","2016-02-01","CZK","2 ",85,100,0,30,0,1000000,4.9700000000000006,0.3,0.3,0.5,0.1,null,null,null,null,0.38999999999999996,0.02,0.01,0.42,1.2200000000000002,3.33]
["02_N","2016-02-01","CZK","3 ",0,85,0,30,0,1000000,3.07,0.3,0.3,0.5,0.1,null,null,null,null,0.38,0.02,0.03,0.43000000000000005,0.72,1.92]
["02_N","2016-02-01","CZK","3 ",85,100,0,30,0,1000000,4.57,0.3,0.3,0.5,0.1,null,null,null,null,0.38,0.02,0.03,0.43000000000000005,1.2200000000000002,2.92]
["02_N","2016-02-01","CZK","5 ",0,85,0,30,0,1000000,3.0700000000000003,0.3,0.3,0.5,0.1,null,null,null,null,0.45999999999999996,0.02,0.09,0.56999999999999995,0.72,1.78]
["02_N","2016-02-01","CZK","5 ",85,100,0,30,0,1000000,4.57,0.3,0.3,0.5,0.1,null,null,null,null,0.45999999999999996,0.02,0.09,0.56999999999999995,1.2200000000000002,2.7800000000000002]
["02_N","2016-02-01","CZK","7 ",0,85,0,30,0,1000000,3.77,0.3,0.3,0.5,0.1,null,null,null,null,0.57999999999999996,0.02,0.31,0.90999999999999992,0.72,2.14]
["02_N","2016-02-01","CZK","7 ",85,100,0,30,0,1000000,5.27,0.3,0.3,0.5,0.1,null,null,null,null,0.57999999999999996,0.02,0.31,0.90999999999999992,1.2200000000000002,3.14]
["02_N","2016-02-01","CZK","CA",0,85,0,30,0,1000000,3.77,0.3,null,null,0.1,0.5,null,null,null,0.37,0.38999999999999996,0.09,0.85,0.72,2.2000000000000002]
["02_N","2016-02-01","CZK","CA",85,100,0,30,0,1000000,5.2700000000000005,0.3,null,null,0.1,0.5,null,null,null,0.37,0.38999999999999996,0.09,0.85,1.2200000000000002,3.2]
["02_S","2016-02-01","CZK","Fl",0,85,0,30,0,1000000,2.79,0.3,null,null,0.1,0.5,null,null,null,0.26,0,0.21999999999999997,0.48,0.34,1.97]
["02_S","2016-02-01","CZK","Fl",85,100,0,30,0,1000000,4.29,0.3,null,null,0.1,0.5,null,null,null,0.26,0,0.21999999999999997,0.48,0.84000000000000008,2.97]
["02_S","2016-02-01","CZK","1 ",0,85,0,30,0,1000000,5.14,0.3,0.3,0.5,0.1,null,null,null,null,0.38999999999999996,0.02,0.01,0.42,0.34,4.38]
["02_S","2016-02-01","CZK","1 ",85,100,0,30,0,1000000,6.64,0.3,0.3,0.5,0.1,null,null,null,null,0.38999999999999996,0.02,0.01,0.42,0.84000000000000008,5.38]
["02_S","2016-02-01","CZK","10",0,85,0,30,0,1000000,4.25,0.3,0.3,0.5,0.1,null,null,null,null,0.77,0.02,0.62,1.4100000000000001,0.34,2.5]
["02_S","2016-02-01","CZK","10",85,100,0,30,0,1000000,5.75,0.3,0.3,0.5,0.1,null,null,null,null,0.77,0.02,0.62,1.4100000000000001,0.84000000000000008,3.5]
["02_S","2016-02-01","CZK","2 ",0,85,0,30,0,1000000,3.09,0.3,0.3,0.5,0.1,null,null,null,null,0.38999999999999996,0.02,0.01,0.42,0.34,2.33]
["02_S","2016-02-01","CZK","2 ",85,100,0,30,0,1000000,4.59,0.3,0.3,0.5,0.1,null,null,null,null,0.38999999999999996,0.02,0.01,0.42,{"$f":"X167","v":0.84000000000000008},3.33]
["02_S","2016-02-01","CZK","3 ",0,85,0,30,0,1000000,2.69,0.3,0.3,0.5,0.1,null,null,null,null,0.38,0.02,0.03,0.43000000000000005,0.34,1.92]
["02_S","2016-02-01","CZK","3 ",85,100,0,30,0,1000000,4.1899999999999995,0.3,0.3,0.5,0.1,null,null,null,null,0.38,0.02,0.03,0.43000000000000005,0.84000000000000008,2.92]
["02_S","2016-02-01","CZK","5 ",0,85,0,30,0,1000000,2.69,0.3,0.3,0.5,0.1,null,null,null,null,0.45999999999999996,0.02,0.09,0.56999999999999995,0.34,1.78]
["02_S","2016-02-01","CZK","5 ",85,100,0,30,0,1000000,4.1900000000000004,0.3,0.3,0.5,0.1,null,null,null,null,0.45999999999999996,0.02,0.09,0.56999999999999995,0.84000000000000008,2.7800000000000002]
["02_S","2016-02-01","CZK","7 ",0,85,0,30,0,1000000,3.39,0.3,0.3,0.5,0.1,null,null,null,null,0.57999999999999996,0.02,0.31,0.90999999999999992,0.34,2.14]
["02_S","2016-02-01","CZK","7 ",85,100,0,30,0,1000000,4.8900000000000006,0.3,0.3,0.5,0.1,null,null,null,null,0.57999999999999996,0.02,0.31,0.90999999999999992,0.84000000000000008,3.14]
["02_S","2016-02-01","CZK","CA",0,80,0,30,0,1000000,3.39,0.3,null,null,0.1,0.5,null,null,null,0.37,0.38999999999999996,0.09,0.85,0.34,2.2000000000000002]
["03_N","2016-02-01","CZK","Fl",0,60,0,30,0,1000000,6.43,0.3,null,null,0.1,0.5,null,null,null,{"$f":"T176","v":0.26},0,0.21999999999999997,0.48,{"$f":"X176","v":0.98},{"$f":"Y176+0.2","v":4.97}]
["03_N","2016-02-01","CZK","Fl",60,80,0,30,0,1000000,6.67,0.3,null,null,0.1,0.5,null,null,null,0.26,0,0.21999999999999997,0.48,1.22,4.97]
["03_N","2016-02-01","CZK","1 ",0,60,0,30,0,1000000,8.7799999999999994,0.3,0.3,0.5,0.1,null,null,null,null,0.38999999999999996,0.02,0.01,0.42,0.98,7.38]
["03_N","2016-02-01","CZK","1 ",60,80,0,30,0,1000000,9.02,0.3,0.3,0.5,0.1,null,null,null,null,{"$f":"T179","v":0.38999999999999996},0.02,0.01,0.42,{"$f":"X179","v":1.22},7.38]
["03_N","2016-02-01","CZK","10",0,60,0,30,0,1000000,7.8900000000000006,0.3,0.3,0.5,0.1,null,null,null,null,0.77,0.02,0.62,1.4100000000000001,0.98,5.5]
["03_N","2016-02-01","CZK","10",60,80,0,30,0,1000000,8.129999999999999,0.3,0.3,0.5,0.1,null,null,null,null,0.77,0.02,0.62,1.4100000000000001,1.22,5.5]
["03_N","2016-02-01","CZK","2 ",0,60,0,30,0,1000000,6.73,0.3,0.3,0.5,0.1,null,null,null,null,0.38999999999999996,0.02,0.01,0.42,0.98,5.33]
["03_N","2016-02-01","CZK","2 ",60,80,0,30,0,1000000,6.97,0.3,0.3,0.5,0.1,null,null,null,null,0.38999999999999996,0.02,0.01,0.42,1.22,5.33]
["03_N","2016-02-01","CZK","3 ",0,60,0,30,0,1000000,6.33,0.3,0.3,0.5,0.1,null,null,null,null,0.38,0.02,0.03,0.43000000000000005,0.98,4.92]
["03_N","2016-02-01","CZK","3 ",60,80,0,30,0,1000000,6.57,0.3,0.3,0.5,0.1,null,null,null,null,0.38,0.02,0.03,0.43000000000000005,1.22,4.92]
["03_N","2016-02-01","CZK","5 ",0,60,0,30,0,1000000,6.33,0.3,0.3,0.5,0.1,null,null,null,null,0.45999999999999996,0.02,0.09,0.56999999999999995,0.98,4.78]
["03_N","2016-02-01","CZK","5 ",60,80,0,30,0,1000000,6.57,0.3,0.3,0.5,0.1,null,null,null,null,0.45999999999999996,0.02,0.09,0.56999999999999995,1.22,4.78]
["03_N","2016-02-01","CZK","7 ",0,60,0,30,0,1000000,7.0299999999999994,0.3,0.3,0.5,0.1,null,null,null,null,0.57999999999999996,0.02,0.31,0.90999999999999992,0.98,5.14]
["03_N","2016-02-01","CZK","7 ",60,80,0,30,0,1000000,7.27,0.3,0.3,0.5,0.1,null,null,null,null,0.57999999999999996,0.02,0.31,0.90999999999999992,1.22,5.14]
["03_N","2016-02-01","CZK","CA",0,60,0,30,0,1000000,7.03,0.3,null,null,0.1,0.5,null,null,null,0.37,0.38999999999999996,0.09,0.85,0.98,5.2]
["03_N","2016-02-01","CZK","CA",60,80,0,30,0,1000000,7.27,0.3,null,null,0.1,0.5,null,null,null,0.37,0.38999999999999996,0.09,0.85,1.22,5.2]
["03_S","2016-02-01","CZK","Fl",0,60,0,30,0,1000000,6.05,0.3,null,null,0.1,0.5,null,null,null,0.26,0,0.21999999999999997,0.48,0.6,4.97]
["03_S","2016-02-01","CZK","Fl",60,80,0,30,0,1000000,6.2899999999999991,0.3,null,null,0.1,0.5,null,null,null,0.26,0,0.21999999999999997,0.48,0.84,4.97]
["03_S","2016-02-01","CZK","1 ",0,60,0,30,0,1000000,8.4,0.3,0.3,0.5,0.1,null,null,null,null,0.38999999999999996,0.02,0.01,0.42,0.6,7.38]
["03_S","2016-02-01","CZK","1 ",60,80,0,30,0,1000000,8.64,0.3,0.3,0.5,0.1,null,null,null,null,{"$f":"T195","v":0.38999999999999996},0.02,0.01,0.42,{"$f":"X195","v":0.84},7.38]
["03_S","2016-02-01","CZK","10",0,60,0,30,0,1000000,7.51,0.3,0.3,0.5,0.1,null,null,null,null,0.77,0.02,0.62,1.4100000000000001,0.6,5.5]
["03_S","2016-02-01","CZK","10",60,80,0,30,0,1000000,7.75,0.3,0.3,0.5,0.1,null,null,null,null,0.77,0.02,0.62,1.4100000000000001,0.84,5.5]
["03_S","2016-02-01","CZK","2 ",0,60,0,30,0,1000000,6.35,0.3,0.3,0.5,0.1,null,null,null,null,0.38999999999999996,0.02,0.01,0.42,0.6,5.33]
["03_S","2016-02-01","CZK","2 ",60,80,0,30,0,1000000,6.59,0.3,0.3,0.5,0.1,null,null,null,null,0.38999999999999996,0.02,0.01,0.42,0.84,5.33]
["03_S","2016-02-01","CZK","3 ",0,60,0,30,0,1000000,5.95,0.3,0.3,0.5,0.1,null,null,null,null,0.38,0.02,0.03,0.43000000000000005,0.6,4.92]
["03_S","2016-02-01","CZK","3 ",60,80,0,30,0,1000000,6.1899999999999995,0.3,0.3,0.5,0.1,null,null,null,null,0.38,0.02,0.03,0.43000000000000005,0.84,4.92]
["03_S","2016-02-01","CZK","5 ",0,60,0,30,0,1000000,5.95,0.3,0.3,0.5,0.1,null,null,null,null,0.45999999999999996,0.02,0.09,0.56999999999999995,0.6,4.78]
["03_S","2016-02-01","CZK","5 ",60,80,0,30,0,1000000,6.19,0.3,0.3,0.5,0.1,null,null,null,null,0.45999999999999996,0.02,0.09,0.56999999999999995,0.84,4.78]
["03_S","2016-02-01","CZK","7 ",0,60,0,30,0,1000000,6.6499999999999995,0.3,0.3,0.5,0.1,null,null,null,null,0.57999999999999996,0.02,0.31,0.90999999999999992,0.6,5.14]
["03_S","2016-02-01","CZK","7 ",60,80,0,30,0,1000000,6.89,0.3,0.3,0.5,0.1,null,null,null,null,0.57999999999999996,0.02,0.31,0.90999999999999992,0.84,5.14]
["03_S","2016-02-01","CZK","CA",0,60,0,30,0,1000000,6.65,0.3,null,null,0.1,0.5,null,null,null,0.37,0.38999999999999996,0.09,0.85,0.6,5.2]
["03_S","2016-02-01","CZK","CA",60,80,0,30,0,1000000,6.8900000000000006,0.3,null,null,0.1,0.5,null,null,null,0.37,0.38999999999999996,0.09,0.85,0.84,5.2]
["02_S","2016-02-01","CZK","CA",85,100,0,30,0,1000000,6.8900000000000006,0.3,null,null,0.1,0.5,null,null,null,{"$f":"T207","v":0.37},{"$f":"U207","v":0.38999999999999996},{"$f":"V207","v":0.09},0.85,{"$f":"X207","v":0.84},{"$f":"Y207+0.2","v":5.2}]

{"sheet":"DefProd","index":17,"n_rows":13,"n_cols":13,"rows_kept":13,"cut":false,"hidden":true,"merged":[]}
["TYP_ID","PRODUCT","VYSE_MIN","MINTEXT","VYSE_MAX","MAXTEXT","FIXACE","SPLATNOST_MIN","SPLATNOST_MAX","MAXBEZALM","VEK_MIN","VEK_MAX","LTV Max"]
["01a_N","Hypoteční úvěr účelový rezidenční Individual",200000,"200.000",999999999,"999.999.999","Float, 1 rok, 2 roky, 3 roky, 5 let, 7 let, 10 let",12,300,20000000,18,99,100]
["01a_S","Hypoteční úvěr účelový rezidenční Individual",200000,"200.000",999999999,"999.999.999","Float, 1 rok, 2 roky, 3 roky, 5 let, 7 let, 10 let",12,360,20000000,18,99,100]
["01c_N","Hypoteční úvěr účelový rezidenční Flexi",200000,"200.000",999999999,"999.999.999","1 rok, 2 roky, 3 roky, 5 let, 7 let, 10 let",12,300,20000000,18,99,100]
["01c_S","Hypoteční úvěr účelový rezidenční Flexi",200000,"200.000",999999999,"999.999.999","1 rok, 2 roky, 3 roky, 5 let, 7 let, 10 let",12,360,20000000,18,99,100]
["01d_N","Hypoteční úvěr účelový rezidenční Plus",200000,"200.000",999999999,"999.999.999","Float, 3 roky, 5 let, 10 let",60,300,20000000,18,99,100]
["01d_S","Hypoteční úvěr účelový rezidenční Plus",200000,"200.000",999999999,"999.999.999","Float, 3 roky, 5 let, 10 let",60,360,20000000,18,99,100]
["01e_N","Hypoteční úvěr účelový rezidenční Twin",200000,"200.000",999999999,"999.999.999","Float, 1 rok, 2 roky, 3 roky, 5 let, 7 let, 10 let",12,300,20000000,18,99,100]
["01e_S","Hypoteční úvěr účelový rezidenční Twin",200000,"200.000",999999999,"999.999.999","Float, 1 rok, 2 roky, 3 roky, 5 let, 7 let, 10 let",12,360,20000000,18,99,100]
["02_N","Hypoteční úvěr účelový nerezidenční",200000,"200.000",999999999,"999.999.999","Float, 1 rok, 2 roky, 3 roky, 5 let, 7 let, 10 let",12,180,20000000,18,99,100]
["02_S","Hypoteční úvěr účelový nerezidenční",200000,"200.000",999999999,"999.999.999","Float, 1 rok, 2 roky, 3 roky, 5 let, 7 let, 10 let",12,360,20000000,18,99,100]
["03_N","Hypoteční úvěr neúčelový",200000,"200.000",10000000,"10.000.000","Float, 1 rok, 2 roky, 3 roky, 5 let, 7 let, 10 let",12,240,20000000,18,99,70]
["03_S","Hypoteční úvěr neúčelový",200000,"200.000",10000000,"10.000.000","Float, 1 rok, 2 roky, 3 roky, 5 let, 7 let, 10 let",12,240,20000000,18,99,70]

{"sheet":"DefSpecPar","index":18,"n_rows":2,"n_cols":3,"rows_kept":2,"cut":false,"hidden":true,"merged":[]}
["PROMENNA","HODNOTA","POPISKA"]
["CardifFeeInFront",3,"Poplatek CARDIF navyšující úvěr"]

{"sheet":"POBOČKY ","index":19,"n_rows":197,"n_cols":11,"rows_kept":197,"cut":false,"hidden":false,"merged":[[0,0,0,4],[4,5,6,5],[4,6,6,6],[4,7,6,7]]}
["SEZNAM POBOČEK UniCredit Bank Czech Republic and Slovakia _platnost od 1.11.2015"]
["code","branch ","street","zip","city","e-mail","tel","fax","manager"]
[null,"OBLAST  PRAHA",null,null,null,null,null,null,"G. Guidi"]
[null,"BANKOVNÍ DŮM NÁM REPUBLIKY",null,null,null,null,null,null,"Achtstaetter Andre"]
[7040,"NR EXPRESNÍ SLUŽBY ","náměstí Republiky 3a","110 00","Praha 1","bankovnidum@unicreditgroup.cz",955959835,221159622,"Voršilka Radek"]
[7042,"NR SLUŽBY NA MÍRU 1 ","náměstí Republiky 3a","110 00","Praha 1",null,null,null,"Lachmanová Barbora"]
[7043,"NR SLUŽBY NA MÍRU 2","náměstí Republiky 3a","110 00","Praha 1",null,null,null,"Seidlová Martina"]
[7046,"SVOBODNÁ POVOLÁNÍ NÁM REP","náměstí Republiky 3a","110 00","Praha 1",null,null,null,"Řídkosil Havlíčková Petra"]
[7090,"INTERNATIONAL  Clients Center","náměstí Republiky 3a","110 00","Praha 1","icc@unicreditgroup.cz","955962060-3",221159622,"Rada Marek"]
[null,"PRAHA SEVEROZÁPAD",null,null,null,null,null,null,"Krausová Petra"]
[7026,"ADRIA","Jungmannova 31","110 00","Praha 1","praha.adria@unicreditgroup.cz",955959840,221153101,"Berka Oldřich"]
[7031,"ARBES","Štefánikova 32","150 00","Praha 5","praha.arbes@unicreditgroup.cz",956959851,221153001,"Švarcova Radka"]
[7027,"HAVELSKÁ","Havelská 19","110 00","Praha 1","praha.havelska@unicreditgroup.cz",955959836,221153501,"Jílek Jan"]
[7030,"VÍTĚZNÉ NÁMĚSTÍ","Vítězné náměstí 10","160 00","Praha 6","praha.vitezne@unicreditgroup.cz",955959852,221153301,"Bošák Ivo"]
[7003,"ANDĚL","Štefánikova 281/4","150 00  ","Praha 5","praha.andel@unicreditgroup.cz",955959850,221155660,"Putnová Romana"]
[7002,"DEJVICKÁ","Dejvická 30","160 00  ","Praha 6","praha.dejvicka@unicreditgroup.cz",955959853,221155640,"Pech Pavel"]
[7033,"HLAVNÍ NÁDRAŽÍ ","Wilsonova 300/8","120 00","Praha 2","praha.hlavninadrazi@unicreditgroup.cz",955959890,221155165,"Losenický Jaroslav"]
[7022,"HOLEŠOVICE","Komunardů 883/24","170 00  ","Praha 7","praha.komunardu@unicreditgroup.cz",955959854,221155670,"Holcová Hana"]
[7017,"KOBYLISKÉ NÁMĚSTÍ","Horňátecká 447/1","180 00  ","Praha 8","praha.kobylisy@unicreditgroup.cz",955959857,221155700,"Nyklíčková Petra"]
[7012,"LAZARSKÁ","Spálená 82/4","110 00  ","Praha 1","praha.lazarska@unicreditgroup.cz",955959837,221155520,"Krausová Petra"]
[7021,"NA POŘÍČÍ","Na Poříčí 1933/36","110 00  ","Praha 1","praha.porici@unicreditgroup.cz",955959838,221155500,"Brabec Ivan"]
[7020,"STROSSMAYEROVO NÁM.","Pplk. Sochora 693/23","170 00  ","Praha 7","praha.strossmayerovo@unicreditgroup.cz",955959855,221155680,"Mašková Lucie"]
[7015,"VÁCLAVSKÉ NÁMĚSTÍ","Václavské náměstí 815/53","110 00  ","Praha 1","praha.vaclavske@unicreditgroup.cz",955959842,221155730,"Losenický Jaroslav"]
[null,"PRAHA JIHOVÝCHOD",null,null,null,null,null,null,"Dzúrová Katarína"]
[7028,"PRAHA - VALDEK","Jugoslávská 29","120 00","Praha 2","praha.valdek@unicreditgroup.cz",955959845,221159722,"Šťastná Romana"]
[7023,"BUDĚJOVICKÁ","Olbrachtova 1946/64","140 00  ","Praha 4","praha.budejovicka@unicreditgroup.cz",955959848,221155580,"Víchová Zuzana"]
[7037,"BUTOVICE ","Petržílkova 1435","158 00","Praha 13","praha.butovice@unicreditgroup.cz ",955959898,221155200,"Dudař Jan"]
[7011,"EDEN","Vršovická 1398/70","101 00  ","Praha 10","praha.eden@unicreditgroup.cz",955959858,221155710,"Hlaváčková Andrea"]
[7007,"FILADELFIE ","Želetavská 1525/1","140 00","Praha 4","praha.filadelfie@unicreditgroup.cz",955959904,221155205,"Víchová Zuzana"]
[7029,"FLÓRA","Vinohradská 151","130 00","Praha 3","praha.flora@unicreditgroup.cz",955959846,221153205,"Kovář Vladimír"]
[7010,"KARLÍN","Thámova 84/23","180 00  ","Praha 8","praha.karlin@unicreditgroup.cz",955959856,221155690,"Libertínová Nikola"]
[7035,"NUSLE ","Nuselská 401/4","140 00","Praha 4","praha.nusle@unicreditgroup.cz ",955959885,221155175,"Bernášková Yveta"]
[7004,"PANKRÁC","Na Pankráci 58","140 00  ","Praha 4","praha.pankrac@unicreditgroup.cz",955959849,221155650,"Hrůza René"]
[7013,"TYLOVO NÁMĚSTÍ","Jugoslávská 479/10","120 00  ","Praha 2","praha.tylovo@unicreditgroup.cz",955959844,221155740,"Ježková Eva"]
[7001,"VINOHRADY","Vinohradská 115","130 00  ","Praha 3","praha.vinohrady@unicreditgroup.cz",955959847,221155570,"Vaňková Aneta"]
[7005,"VRŠOVICE ","Moskevská 345/39","101 00","Praha 10","praha.vrsovice@unicreditgroup.cz",955959905,221155210,"Bernášková Yveta"]
[7034,"VYSOČANY ","Freyova 945/35","190 00","Praha 9","praha.vysocany@unicreditgroup.cz",955959884,221155190,"Holec Miloš"]
[7036,"ŽIŽKOV ","Jana Želivského 1859/29","130 00","Praha 3","praha.zizkov@unicreditgroup.cz",955959886,221155180,"Chovančíková Paštová Eva"]
[null,"SMALL BUSINESS PRAHA ",null,null,null,null,null,null,"Kosmata Vladimír"]
[7091,"SB HUB BANKOVNÍ DUM","náměstí Republiky 3a","110 00","Praha 1","praha.sbbh@unicreditgroup.cz,",955959835,221159622,"Polešák Miloň"]
[7092,"SB HUB VALDEK","Jugoslávská 29","120 00","Praha 2","praha.sbvaldek@unicreditgroup.cz",955959845,221159722,"Tichý Marcel"]
[7093,"SB HUB FILADELFIE","Želetavská 1525/1","140 00","Praha 4","praha.sbfiladelfie@unicreditgroup.cz",955960231,221155205,"Cvejn František"]
[null,"OBLAST ČECHY A MORAVA",null,null,null,null,null,null,"Komárek Petr"]
[null,"JIŽNÍ ČECHY",null,null,null,null,null,null,"Hrubec Pavel"]
[7307,"PLZEŇ NÁM. REPUBLIKY","nám. Republiky/Riegrova 1","301 00 ","Plzeň","plzen.republiky@unicreditgroup.cz",955959834,221157001,"Tomandl Václav"]
[7709,"BENEŠOV ","Masarykovo Náměstí/Řeznická 228","256 01","Benešov","benesov@unicreditgroup.cz",955959903,221155005,"KohárováJaroslava"]
[7500,"ČESKÉ BUDĚJOVICE NÁMĚSTÍ","nám. Přemysla Otakara II. č. 122/35","370 21 ","České Budějovice","cb.otakara@unicreditgroup.cz",955959815,221155620,"Valenta Dalibor"]
[7506,"ČESKÉ BUDĚJOVICE IGY ","Pražská třída 1247/24","370 04","České Budějovice 3","cb.igy@unicreditgroup.cz",955959814,221155225,"Beneš Filip"]
[7504,"JINDŘICHUV HRADEC ","Nám. Míru 164,","377 01","Jindřichův Hradec","jindrichuvhradec@unicreditgroup.cz",955959872,221155045,"Macků Martin"]
[7313,"KLATOVY ","Kpt. Jaroše 47","339 01","Klatovy","klatovy@unicreditgroup.cz  ",955959897,221155060,"Jiřičková Lenka"]
[7502,"PÍSEK","Alšovo náměstí 16","397 01  ","Písek","pisek@unicreditgroup.cz",955959832,221155720,"Podhrázská Michaela"]
[7304,"PLZEŇ AMERICKÁ","Americká 72","301 50  ","Plzeň","plzen.americka@unicreditgroup.cz",955959833,221155510,"Urválek Vít"]
[7312,"PLZEŇ KOTEROVSKÁ ","Koterovská 2040/116","326 00","Plzeň","plzen.koterovska@unicreditgroup.cz ",955959893,221155115,"Altmanová Michaela"]
[7309,"PŘÍBRAM","Náměstí T.G. Masaryka 144","261 01","Příbram","pribram@unicreditgroup.cz",955959860,221157920,"Pekárik Pavel"]
[7505,"STRAKONICE ","Lidická 207","386 01","Strakonice","strakonice@unicreditgroup.cz",955959895,221155125,"Reiser Vít"]
[7501,"TÁBOR","třída 9. května 2886","390 02  ","Tábor","tabor@unicreditgroup.cz",955959862,221155590,"John Přemysl"]
[null,"SEVEROVÝCHODNÍ  ČECHY",null,null,null,null,null,null,"Hubeňák Radek"]
[7703,"HRADEC KRÁLOVÉ","Ulrichovo nám. 854","500 02 ","Hradec Králové","hradec.ulrichovo@unicreditgroup.cz",955959818,221157701,"Matajová Lydie"]
[7403,"LIBEREC MOSKEVSKÁ","Moskevská 638/8","460 01  ","Liberec","liberec.moskevska@unicreditgroup.cz",955959825,221157501,"Smítka Václav"]
[7701,"HRADEC KRÁLOVÉ KARLA IV.","Karla IV. 522","500 02  ","Hradec Králové","hradec.karlaiv@unicreditgroup.cz",955959819,221155760,"Holoubek Luboš"]
[7410,"JABLONEC NAD NISOU","Máchova 21/2 ","466 01","Jablonec n. Nisou","jablonec@unicreditgroup.cz",955959875,221155040,"Klíma Luděk"]
[7706,"KOLÍN ","Pražská 167","280 02","Kolín","kolin@unicreditgroup.cz",955959868,221155065,"Králiková Ilona"]
[7708,"KUTNÁ HORA ","Šultysova 153","284 01","Kutná Hora","kutnahora@unicreditgroup.cz ",955959894,221155070,"Archalous Petr"]
[7413,"LIBEREC NISA","České Mládeže 456","460 03","Liberec","liberec.nisa@unicreditgroup.cz  ",955959899,221155075,"Pavlíková Miroslava"]
[7407,"MLADÁ BOLESLAV","Českobratrské nám. 1321","293 01 ","Mladá Boleslav","mb.ceskobratrske@unicreditgroup.cz",955959826,221157601,"Bázler Petr"]
[7707,"NÁCHOD","Palackého 921","547 01","Náchod","nachod@unicreditgroup.cz",955959878,221155095,"Janečka Zdeněk"]
[7700,"PARDUBICE","třída Míru 92","530 01  ","Pardubice","pardubice.grand@unicreditgroup.cz",955959831,221157801,"Boušková Šárka"]
[7705,"TRUTNOV ","Krakonošovo nám. 133","541 01","Trutnov","trutnov@unicreditgroup.cz",955959867,221155135,"Brádler Petr "]
[null,"SEVEROZÁPADNÍ ČECHY",null,null,null,null,null,null,"Keller David"]
[7300,"KARLOVY VARY TGM","Zeyerova 892/7","360 01  ","Karlovy Vary","kv.tgm@unicreditgroup.cz",955963835,221157201,"Duřtová Vladimíra"]
[7405,"ÚSTÍ NAD LABEM","Mírové nám. 35A","400 01 ","Ústí/ Labem","usti.mirove@unicreditgroup.cz",955959865,221157401,"Kalabisová Danuše"]
[7311,"BEROUN ","Husovo nám. 11/83","266 01","Beroun","beroun@unicreditgroup.cz",955959888,221155010,"Tvrdík Pavel"]
[7411,"ČESKÁ LÍPA ","Jindřicha z Lipé 108","470 01","Česká Lípa","ceskalipa@unicreditgroup.cz",955959891,221155025,"Poláková Dagmar"]
[7408,"DĚČÍN","Husovo nám. 74/5","405 02","Děčín","decin@unicreditgroup.cz",955959817,221157940,"Kotrba Jan"]
[7308,"CHEB","Svobody 520/3","350 02","Cheb","cheb@unicreditgroup.cz",955964254,221157900,"Jonátová Zdeňka"]
[7303,"CHOMUTOV","Revoluční 36 / Husovo náměstí","430 01  ","Chomutov","chomutov.revolucni@unicreditgroup.cz",955959821,221157301,"Trýznová Petra"]
[7310,"KLADNO ","Havířská 96","272 01","Kladno","kladno@unicreditgroup.cz",955959879,221155055,"Tvrdík Pavel"]
[7414,"LITOMĚŘICE ","Michalská 40/2","412 01","Litoměřice","litomerice@unicreditgroup.cz",955959906,221155080,"Štemberová Magdalena"]
[7412,"MĚLNÍK ","nám. Karla IV. 143","276 01","Mělník ","melnik@unicreditgroup.cz",955959883,221155085,"Jourová Svatava"]
[7409,"MOST","Budovatelů 295","434 01","Most","most@unicreditgroup.cz",955959869,221155090,"Málek David"]
[7402,"TEPLICE","náměstí Svobody 40/1","415 01  ","Teplice","teplice@unicreditgroup.cz",955959863,221155600,"Silnicová Daniela"]
[null,"BRNO ",null,null,null,null,null,null,"Klíma Jan"]
[7100,"BRNO DIVADELNÍ","Divadelní 2","601 57  ","Brno","brno.divadelni@unicreditgroup.cz",955959810,221155610,"Smělý Ondřej"]
[7108,"BRNO KOBLIŽNÁ","nám. Svobody 7","602 00 ","Brno","brno.koblizna@unicreditgroup.cz",955959811,221154101,"Homolová Iva"]
[7109,"BRNO TRINITI","Úzká 488/8","602 00 ","Brno","brno.triniti@unicreditgroup.cz",955959812,221154001,"Klíma Jan"]
[7120,"BRNO KRÁLOVO POLE","Palackého třída 721/78","612 00","Brno","brno.kralovopole@unicreditgroup.cz ",955959900,221155195,"Vašíček Tomáš"]
[7111,"BRNO SPIELBERK","Holandská 2","639 00","Brno","brno.spielberk@unicreditgroup.cz",955959813,221155630,"Havlíková Romana"]
[7121,"BRNO JOŠTOVA ","Joštova 138/4","602 00","Brno","brno.jostova@unicreditgroup.cz",955959930,221155220,"Machát Norbert"]
[null,"JIHOZÁPADNÍ  MORAVA",null,null,null,null,null,null,"Ligmajer Jan"]
[7101,"JIHLAVA","Masarykovo náměstí 54","586 01  ","Jihlava","jihlava.masarykovo@unicreditgroup.cz",955959822,221154501,"Kozub Ondřej"]
[7602,"ZLÍN BARTOŠOVA","Bartošova 5532","760 01 ","Zlín","zlin.bartosova@unicreditgroup.cz",955959866,221154301,"Fľaková Katarína"]
[7118,"BLANSKO ","Wanklovo nám. 1436","678 01","Blansko","blansko@unicreditgroup.cz",955959882,221155015,"Sedlák Zdeněk"]
[7116,"BŘECLAV ","Ul. 17. listopadu 3","690 02","Břeclav","breclav@unicreditgroup.cz",955959881,221155020,"Cymbál Petr"]
[7115,"HAVLÍČKUV BROD ","Havlíčkovo náměstí 158","580 01","Havlíčkův Brod","havlickuvbrod@unicreditgroup.cz",955959874,221155035,"Vranková Dana"]
[7601,"KROMĚŘÍŽ","Vodní/Farní 95","767 01  ","Kroměříž","kromeriz@unicreditgroup.cz",955959824,221155780,"Režňáková Lenka"]
[7104,"PROSTĚJOV","náměstí T.G.Masaryka 8","796 01  ","Prostějov","prostejov@unicreditgroup.cz",955959859,221155530,"Kasanová Monika"]
[7113,"TŘEBÍČ","Komenského nám. 1045/18","674 01","Třebíč","trebic@unicreditgroup.cz",955959864,221154640,"Hampová Andrea"]
[7603,"UHERSKÉ HRADIŠTĚ ","Palackého náměstí 175","686 01","Uherské Hradiště","uherskehradiste@unicreditgroup.cz",955959908,221155140,"Mikušová Pavla"]
[7119,"VYŠKOV","Masarykovo nám. 145/30","685 01","Vyškov","vyskov@unicreditgroup.cz",955959889,221155150,"Vanderka Zbyněk"]
[7604,"ZLÍN NÁMĚSTÍ MÍRU ","Náměstí Míru 66","760 01","Zlín","zlin.namestimiru@unicreditgroup.cz",955959929,221155215,"Očadlík Jiří"]
[7114,"ZNOJMO ","Horní nám. 139","669 02","Znojmo","znojmo@unicreditgroup.cz",955959871,221155160,"Střecha Karel"]
[7117,"ŽĎÁR NAD SÁZAVOU ","Náměstí Republiky 145","591 01","Žďár nad Sázavou","zdarnadsazavou@unicreditgroup.cz",955959880,221155155,"Loučka Petr"]
[null,"SEVEROVÝCHODNÍ  MORAVA",null,null,null,null,null,null,"Guzik Rudolf"]
[7110,"OLOMOUC","28. října 15","772 00 ","Olomouc","olomouc.28rijna@unicreditgroup.cz",955959827,221154401,"Polednová Simona"]
[7804,"OSTRAVA","28.října 3348/65","702 00 ","Ostrava","ostrava.karolina@unicreditgroup.cz",955959829,221154201,"Špaltová Zdeňka"]
[7805,"FRÝDEK - MÍSTEK","Pivovarská 2340","738 01","Frýdek-Místek","frydek-mistek@unicreditgroup.cz",955959816,221154600,"Matzner Rostislav"]
[7811,"HAVÍŘOV ","Československé armády 195/1a","736 01","Havířov","havirov@unicreditgroup.cz",955959901,221155030,"Kopečková Lucie"]
[7808,"KARVINÁ ","Třída Osvobození 1720/11","735 06","Karviná","karvina@unicreditgroup.cz",955959887,221155050,"Jantoš Petr"]
[7806,"NOVÝ JIČÍN ","Ul. 5. května 18","741 01","Nový Jičín","novyjicin@unicreditgroup.cz",955959870,221155100,"Bauer Eduard"]
[7122,"OLOMOUC ŠANTOVKA ","Polská 1","772 00","Olomouc","olomouc.santovka@unicreditgroup.cz",955959932,221155105,"Kinová Marie"]
[7801,"OPAVA","Ostrožná 18","746 01  ","Opava 1","opava@unicreditgroup.cz",955959828,221155790,"Matlochová Renáta"]
[7812,"OSTRAVA HRABUVKA ","Horní 1642/55a","700 30","Ostrava Hrabůvka","ostrava.hrabuvka@unicreditgroup.cz",955959907,221155110,"Durčák Michal"]
[7803,"OSTRAVA PORUBA","Hlavní tř. 583/99","708 00  ","Ostrava Poruba","ostrava.poruba@unicreditgroup.cz",955959830,221155770,"Trbušek Radim "]
[7809,"PŘEROV ","Čechova 37","750 02","Přerov","prerov@unicreditgroup.cz",955959896,221155120,"Přidalová Libuše"]
[7112,"ŠUMPERK","Náměstí Svobody 2840","780 01","Šumperk","sumperk@unicreditgroup.cz",955959861,221154620,"Krňávek Pavel"]
[7807,"TŘINEC ","Nám. Svobody 527","739 61","Třinec","trinec@unicreditgroup.cz",955959873,221155130,"Galuszková Dagmar"]
[7810,"VALAŠSKÉ MEZIŘÍČÍ ","Náměstí 90/23","757 01","Valašské Meziříčí","valasskemezirici@unicreditgroup.cz ",955959892,221155145,"Ptáček Bronislav",null,70]
[7820,"SB HUB OSTRAVA ","Smetanovo nám. 1","702 00 ","Ostrava","sbostrava@unicreditgroup.cz",955959829,221154201,"Kocián Vladimír"]
[null,"SLOVENSKO"]
[null,"BRATISLAVA",null,null,null,null,null,null,"Burian Marian"]
[7200,"Krížna","Krížna 50","821 08","Bratislava","zuzana.hullajurkovska@unicreditgroup.sk","918 501 736","02/49504412","Hulla Jurkovská Zuzana"]
[7201,"Panenská","Panenská 7","811 03","Bratislava","katarina.janosikovasikutova@unicreditgroup.sk",908721174,"02/54413228","Šikutová Jánošiková Katarína"]
[7202,"Aupark","Einsteinova","851 01","Bratislava","jana.dudasova@unicreditgroup.sk",908782244,"02/68202035","Dudášová Jana"]
[7203,"Šancová ","Šancová 1/A","813 33","Bratislava","darina.mokosova@unicreditgroup.sk",905925740,"02/49502505","Mokošová Darina"]
[7204,"Dulovo nám.","Dulovo nám. 13","821 08","Bratislava","martina.bohmova@unicreditgroup.sk",907984214,"02/50202066","Böhmová Martina"]
[7205,"Park One","Nám. 1. Mája 18","811 06","Bratislava","janette.petrovicova@unicreditgroup.sk",908721045,"02/49504501","Petrovičová Eliášová Janette "]
[7206,"BiznisDom, Šancová","Krížna 50","813 33","Bratislava","peter.horny@unicreditgroup.sk",908721156,"02/49502595","Horný Peter"]
[7207,"Dúbravská","Dúbravská 2","841 04","Bratislava","tomas.bondor@unicreditgroup.sk",918501728,"02/59202030","Bondor Tomáš"]
[7208,"Dunajská","Dunajská 25","811 08","Bratislava","renata.medvedova@unicreditgroup.sk",905400990,"02/40255704","Medveďová Renáta"]
[7209,"Hurbanovo nám.","Hurbanovo nám.1","811 06","Bratislava","marta.manasova@unicreditgroup.sk",905925738,"02/59305415","Manasová Marta"]
[7210,"Plynárenská","Plynárenská 7/A","821 09","Bratislava","eduard.turcanik@unicreditgroup.sk",905227953,"02/58103085","Turčánik Eduard"]
[7216,"Mostová","Mostová 6, 811 02 ","811 02","Bratislava","marta.chachalakova@unicreditgroup.sk",918501611,"02/59428000","Chachaľáková Marta"]
[7211,"ROZADOL","Trenčianska 56/A","821 09","Bratislava","erika.timoranska@unicreditgroup.sk",905479926,"02/58101070","Satko Ľubomír"]
[7212,"HRON","Dudvážska 5","821 07","Bratislava","michal.marada@unicreditgroup.sk",918861192,"02/40255700","Marada Michal"]
[7213,"Rustica","Saratovská 6B","841 02","Bratislava","zuzana.adamcikova@unicreditgroup.sk",918501743,"02/58101403","Adamčíková Zuzana"]
[7215,"Polus CC","Vajnorská 100","831 04","Bratislava","alica.pavlovcikova@unicreditgroup.sk",903205107,"02/49114800","Pavlovčíková Alica"]
[7217,"AVION","Ivánska cesta 16","821 04","Bratislava","andrea.sokolova@unicreditgroup.sk",918501670,"02/48252700","Sokolová Andrea "]
[null,"ZÁPADNÉ SLOVENSKO",null,null,null,null,null,null,"Paulen Maroš"]
[7218,"Trnava","Štefánikova 48, 917 01","917 01","Trnava","eva.markovicova@unicreditgroup.sk",915786006,"033/5908305","Markovičová Eva"]
[7219,"Malacky","Záhorácka 51, 901 01","901 01","Malacky","filip.tikl@unicreditgroup.sk",905748732,"034/7979279","Tikl Filip"]
[7220,"Piešťany","Nitrianska 5, 921 01","921 01","Piešťany","maria.selecka@unicreditgroup.sk",908721069,"033/7910833","Selecká Mária"]
[7221,"Pezinok","Holubyho 27, 902 01","902 01","Pezinok","barbora.stefanovicova@unicreditgroup.sk",918501672,"033/6905405","Štefanovičová Barbora "]
[7222,"Skalica","Škarniclovská 1, 909 01","909 01","Skalica","jan.kristofik@unicreditgroup.sk",908721039,"034/6906125 ","Krištofík Ján"]
[7223,"Senica","Hviezdoslavova 61, 905 01","905 01","Senica","jan.blazek@unicreditgroup.sk",907988026,"034/6909133","Blažek Ján"]
[7224,"Hlohovec","M.R.Štefánika 4, 920 01","920 01","Hlohovec","juraj.kollar@unicreditgroup.sk",915913940,"033/7351015","Kollár Juraj"]
[7225,"Trenčín","Nám.Svätej Anny 3, 911 01","911 01","Trenčín","anna.misikova@unicreditgroup.sk",908793817,"032/6509203","Mišíková Anna"]
[7226,"Nové Mesto nad V.","Čsl.armády 4, 915 01","915 01","Nové Město nad V.","zaneta.brezovska@unicreditgroup.sk",905479912,"032/7484995","Brezovská Žaneta"]
[7227,"Myjava","M.R.Štefánika 581/29A, 907 01","907 01","Myjava","martin.kovarik@unicreditgroup.sk",918501679,"034/6983300","Kovárik Martin"]
[7228,"Bánovce nad Bebravou","Jesenského 561/3, 957 01","957 01","Bánovce nad Bebravou","linda.cikelova@unicreditgroup.sk",918501702,"038/7627015","Čikelová Linda"]
[7229,"Považská Bystrica","M.R.Štefánika 161/4, 017 01","017 01","Považská Bystrica","martina.stefancova@unicreditgroup.sk",905455880,"042/4379955","Štefancová Martina"]
[7230,"Senec","Lichnerova 30, 903 01","903 01","Senec","natalia.batalikova@unicreditgroup.sk",908764266,"02/40202055","Baťalíková Natália"]
[null,"ZÁPADNÉ SLOVENSKO II",null,null,null,null,null,null,"Pavle Josef"]
[7231,"Nitra ","Štefánikova tr.13","949 01","Nitra","zuzana.chrenekova@unicreditgroup.sk",908721096,"037/6926051","Chreneková Zuzana"]
[7232,"Nitra ZOC MAX","Chrenovská 1661/30","949 01","Nitra","monika.kovacova@unicreditgroup.sk",918501674,"037/6928900","Kováčová Monika"]
[7233,"Topolčany","Krušovská 19","955 01","Topolčany","peter.hollan@unicreditgroup.sk",915785998,"038/5327055","Hollan Peter"]
[7235,"Nové Zámky","Majzonovo nám.2","940 01","Nové Zámky","kvetoslava.polacekova@unicreditgroup.sk",918868118,"035/6913433","Poláčeková Kvetoslava"]
[7236,"Levice","Sv. Michala 4 (blok ATOM 2)","934 01","Levice","helena.gregusova@unicreditgroup.sk",908721058,"036/6350315","Gregušová Helena "]
[7237,"Dunajská Streda","Hlavná 5599/3B","929 01","Dunajská Streda","ivana.nagyova@unicreditgroup.sk",907735739,"031/5905500","Nagyová Ivana"]
[7238,"Galanta","Revolučná 1","924 01","Galanta","anna.cetliova@unicreditgroup.sk",908721102,"031/7884500 ","Cetliová Anna"]
[7239,"Komárno","Palatínova 39","945 05","Komárno","katarina.csoma@unicreditgroup.sk",908721158,"035/7900065","Csoma Katarína"]
[7240,"Šala","Hlavná 12A","927 01","Šala","maria.stranakova@unicreditgroup.sk",905231101,"031/7838700","Straňáková Mária"]
[7241,"Prievidza","G.Švéniho 3A","971 01","Prievidza","klaudius.satek@unicreditgroup.sk",918501676," 046/5189420 046/5189400","Šátek Klaudius"]
[7243,"Sereď","Dionýza Štúra 1012","926 01","Sereď","adriana.kopplova@unicreditgroup.sk",905479916,"031/7892707","Köpplová Adriana"]
[7244,"Šamorín","Gazdovský rad 49/B","931 01","Šamorín","gabriella.nagy@unicreditgroup.sk",908721105,"031/5627962","Nagy Gabriella "]
[null,"STREDNÉ SLOVENSKO",null,null,null,null,null,null,"Hazlinger Jaroslav"]
[7245,"Žilina","Národná 12","010 01","Žilina","igor.kusy@unicreditgroup.sk",908799742,"041/5628205","Kusý Igor"]
[7246,"Žilina Aupark","Veľká okružná 59A","010 01","Žilina","jana.kalisova@unicreditgroup.sk",918501629,"041/5628500","Kališová Janka"]
[7247,"Martin","M.R.Štefánika 1","036 01","Martin","ladislav.zalepa@unicreditgroup.sk",905455828,"043/4207011","Zálepa Ladislav"]
[7248,"Čadca","Palárikova 85","022 01","Čadca","robert.casnocha@unicreditgroup.sk",908788703,"041/4302815","Časnocha Róbert"]
[7249,"Liptovský Mikuláš","Nám.Osloboditeľov 7","031 01","Liptovský Mikuláš","katarina.dzurova@unicreditgroup.sk",918501623,"044/5475005","Dzúrová Katarína"]
[7250,"Ružomberok","Mostová 2","034 01","Ružomberok","andrea.stefanekova@unicreditgroup.sk",918501626,"044/4320660","Štefáneková Andrea"]
[7251,"Zvolen","Nám.SNP 50","960 01","Zvolen","ines.kentosova@unicreditgroup.sk",908721112,"045/5248016","Kentošová Ines"]
[7252,"Banská Bystrica","SC EUROPA, Na Troskách 25","974 01","Banská Bystrica","erika.sochorova@unicreditgroup.sk",905479921,"048/4723000","Sochorová Erika"]
[7253,"Banská Bystrica","Nám. SNP 18","974 01","Banská Bystrica","peter.likavec@unicreditgroup.sk",918501631,"048/4719700","Likavec Peter"]
[7254,"Lučenec","Železničná 15","984 01","Lučenec","peter.grenda@unicreditgroup.sk",908721114,"047/4303520","Grenda Peter"]
[7255,"Brezno","ČSA 17","977 01","Brezno","branislav.grecmal@unicreditgroup.sk",908793816,"048/6700055","Parašínová Erika"]
[7256,"Žiar nad Hronom","Š.Moyzesa 427","965 01","Žiar nad Hronom","anna.sykorova@unicreditgroup.sk",918501709,"045/6788905","Sýkorová Anna"]
[null,"VÝCHODNÉ SLOVENSKO",null,null,null,null,null,null,"Rampáčková Jana"]
[7257,"Košice","Rooseveltova 10","040 01","Košice","svetlana.kovacova@unicreditgroup.sk",908721120,"055/6232741","Kováčová Svetlana"]
[7258,"Košice","Toryská 1/C","040 11","Košice","gabriela.vargova@unicreditgroup.sk",905899851,"055/7881860","Vargová Gabriela"]
[7259,"Košice","Mlynská 7","040 01","Košice","michal.bronis@unicreditgroup.sk",918501646,"055/7281911","Broniš Michal"]
[7260,"Košice Aupark","Nám. Osloboditeľov","040 01","Košice","peter.bakajsa@unicreditgroup.sk",918501647,"055/7262500","Bakajsa Peter"]
[7261,"Michalovce","Nám.Osloboditeľov 1","071 01","Michalovce","zuzana.cervenakova@unicreditgroup.sk",905444157,"056/6880707","Červenáková Zuzana"]
[7262,"Rožňava","Nám.Baníkov 33","048 01","Rožňava","erika.brezinova@unicreditgroup.sk",908721033,"058/7880700","Brezinová Erika"]
[7263,"Čierna nad Tisou","Hlavná 11","076 43","Čierna nad Tisou","sarlota.takacsova@unicreditgroup.sk",908721122,"056/6871540","Takácsová Šarlota"]
[7264,"Trebišov","M.R.Štefánika 20","075 01","Trebišov","aneta.bernatova@unicreditgroup.sk",917225445,"056/6670015","Bernátová Aneta"]
[7265,"Prešov","Hlavná 29","080 01","Prešov","eva.orgovanova@unicreditgroup.sk",908712030,"051/7729605","Orgovánová Eva"]
[7266,"Prešov ZOC MAX","Vihorlatská 2A ","080 01","Prešov","stefan.tomasik@unicreditgroup.sk",903205143,"051/7563000","Tomášik Štefan"]
[7267,"Bardejov","Dlhý rad 17","085 01","Bardejov","maria.hudakova@unicreditgroup.sk",908721134,"054/4880410","Hudáková Mária"]
[7268,"Humenné","Mierová 64/2","066 01","Humenné","emilia.behunova@unicreditgroup.sk",907735669,"057/7862341","Behúňová Emilia"]
[7269,"Poprad","Popradské nábr.18","058 01","Poprad","jozef.sinko@unicreditgroup.sk",907735648,"052/7870327","Šinko Jozef"]
[7270,"Spišská Nová Ves","Zimná 56","052 01","Spišská Nová Ves","miroslav.pekarcik@unicreditgroup.sk",908721139,"053/4425788","Pekarčík Miroslav"]
[7271,"Kežmarok","Hlavné nám.3","060 01","Kežmarok","daniel.macicak@unicreditgroup.sk",917912790,"052/4680035","Mačičák Daniel"]
[7272,"Levoča","Nám. Majstra Pavla č.19","054 01","Levoča","rastislav.sloboda@unicreditgroup.sk",911991444,"053/4182600","Sloboda Rastislav"]
[null,"Multi - Channel Banking"]
[7095,"SB Remote Services","Želetavská 1525/1","140 00","Praha 4","firmyapodnikatele@unicreditgroup.cz ","800 149 999",null,"Hudobová Lenka"]
[7273,"BRAC","Krížna 50","821 08","Bratislava","anita.polovic@unicreditgroup.sk",905400046,"02/49504415","Polovic Anita"]

{"sheet":"Nemovitost","index":20,"n_rows":182,"n_cols":33,"rows_kept":182,"cut":false,"hidden":false,"merged":[[87,10,87,16],[87,27,87,30],[74,10,74,16],[79,27,79,30],[81,27,81,30],[54,7,54,16],[79,7,79,16],[77,7,77,16],[52,7,52,16],[52,27,52,30],[49,10,49,16],[50,10,50,16],[54,27,54,30],[73,10,73,16],[81,10,81,16],[83,10,83,16],[85,10,85,16],[85,27,85,30],[181,4,181,18],[181,19,181,21],[181,22,181,25],[181,26,181,28],[181,29,181,31],[179,5,179,10],[179,16,179,18],[179,19,179,21],[179,22,179,25],[179,26,179,28],[179,29,179,31],[177,5,177,10],[177,16,177,18],[177,19,177,21],[177,22,177,25],[177,26,177,28],[177,29,177,31],[175,5,175,10],[175,16,175,18],[175,19,175,21],[175,22,175,25],[175,26,175,28],[175,29,175,31],[173,5,173,10],[173,16,173,18],[173,19,173,21],[173,22,173,25],[173,26,173,28],[173,29,173,31],[171,5,171,10],[171,16,171,18],[171,19,171,21],[171,22,171,25],[171,26,171,28],[171,29,171,31],[169,5,169,10],[169,16,169,18],[169,19,169,21],[169,22,169,25],[169,26,169,28],[169,29,169,31],[167,5,167,10],[167,16,167,18],[167,19,167,21],[167,22,167,25],[167,26,167,28],[167,29,167,31],[165,5,165,10],[165,16,165,18],[165,19,165,21],[165,22,165,25],[165,26,165,28],[165,29,165,31],[163,5,163,10],[163,16,163,18],[163,19,163,21],[163,22,163,25],[163,26,163,28],[163,29,163,31],[161,5,161,10],[161,16,161,18],[161,19,161,21],[161,22,161,25],[161,26,161,28],[161,29,161,31],[159,5,159,10],[159,16,159,18],[159,19,159,21],[159,22,159,25],[159,26,159,28],[159,29,159,31],[157,5,157,10],[157,16,157,18],[157,19,157,21],[157,22,157,25],[157,26,157,28],[157,29,157,31],[155,5,155,10],[155,16,155,18],[155,19,155,21],[155,22,155,25],[155,26,155,28],[155,29,155,31],[153,5,153,10],[153,16,153,18],[153,19,153,21],[153,22,153,25],[153,26,153,28],[153,29,153,31],[151,5,151,10],[151,16,151,18],[151,19,151,21],[151,22,151,25],[151,26,151,28],[151,29,151,31],[149,5,149,10],[149,16,149,18],[149,19,149,21],[149,22,149,25],[149,26,149,28],[149,29,149,31],[147,5,147,10],[147,16,147,18],[147,19,147,21],[147,22,147,25],[147,26,147,28],[147,29,147,31],[139,22,139,25],[139,26,139,28],[139,29,139,31],[141,5,141,10],[141,16,141,18],[141,19,141,21],[141,22,141,25],[141,26,141,28],[145,5,145,10],[145,16,145,18],[145,19,145,21],[145,22,145,25],[145,26,145,28],[145,29,145,31],[141,29,141,31],[143,5,143,10],[143,16,143,18],[143,19,143,21],[143,22,143,25],[143,26,143,28],[143,29,143,31],[134,4,136,8],[134,9,136,13],[139,5,139,10],[139,11,139,15],[125,4,125,8],[125,9,125,14],[125,15,129,18],[139,16,139,18],[139,19,139,21],[119,4,119,8],[119,9,119,14],[119,15,123,18],[119,19,123,22],[121,4,121,8],[121,9,121,14],[125,19,129,22],[125,25,125,29],[125,30,125,32],[127,4,127,8],[127,9,127,14],[127,25,129,29],[127,30,129,32],[121,25,121,29],[121,30,121,32],[123,4,123,8],[123,9,123,14],[123,25,123,29],[123,30,123,32],[129,4,129,8],[129,9,129,14],[113,4,113,8],[113,9,113,14],[113,15,117,18],[113,19,117,22],[113,25,113,29],[113,30,113,32],[115,4,115,8],[115,9,115,14],[115,25,115,29],[115,30,115,32],[117,4,117,8],[117,9,117,14],[117,25,117,29],[117,30,117,32],[107,30,107,32],[109,4,109,8],[109,9,109,14],[111,4,111,8],[111,9,111,14],[111,25,111,29],[111,30,111,32],[103,25,105,31],[104,15,106,18],[104,19,106,22],[105,4,105,8],[105,9,105,14],[107,4,107,8],[107,9,107,14],[107,15,111,18],[107,19,111,22],[107,25,109,29],[39,20,40,25],[39,27,40,30],[98,10,98,16],[98,20,100,24],[56,27,56,30],[64,4,65,8],[64,10,65,16],[64,20,65,25],[64,27,65,30],[56,10,56,16],[58,10,58,16],[60,10,60,16],[60,27,60,30],[62,10,62,16],[62,27,62,30],[77,27,77,30],[75,10,75,16],[89,4,90,8],[89,10,90,16],[89,20,90,25],[48,27,48,30],[73,27,73,30],[89,27,90,30],[48,10,48,16],[37,27,37,30],[24,10,24,16],[25,10,25,16],[29,27,29,30],[31,27,31,30],[5,7,5,11],[5,19,5,27],[7,3,7,8],[23,10,23,16],[27,27,27,30],[31,10,31,16],[33,10,33,16],[35,10,35,16],[35,27,35,30],[16,20,16,30],[16,11,16,16],[18,11,18,30],[27,7,27,16],[29,7,29,16],[23,27,23,30],[11,21,11,30],[3,2,3,10],[179,11,179,15],[141,11,141,15],[143,11,143,15],[145,11,145,15],[147,11,147,15],[149,11,149,15],[151,11,151,15],[153,11,153,15],[155,11,155,15],[157,11,157,15],[159,11,159,15],[161,11,161,15],[163,11,163,15],[165,11,165,15],[167,11,167,15],[169,11,169,15],[171,11,171,15],[173,11,173,15],[175,11,175,15],[177,11,177,15],[37,10,37,16],[39,4,40,8],[39,10,40,16]]}
[]
[]
[]
[null,null,"NEMOVITOST"]
[]
[null,null,null,null,null,null,"Jméno klienta",{"$f":"IF(SplatkaJmenoKlienta=\"\",\"\",SplatkaJmenoKlienta)","v":""},null,null,null,null,null,null,null,null,null,null,"Příjmení klienta",{"$f":"IF(SplPrijmeniKlienta=\"\",\"\",SplPrijmeniKlienta)","v":""}]
[]
[null,null,null,"Tržní hodnota nemovitosti"]
[]
[null,null,null,null,"Počet nemovitostí v zástavě:",null,null,null,null,null,1,null,null,null,null,null,null,"Jedná se o úvěr pro zaměstnance skupiny UCI či důchodce banky"]
[]
[null,null,null,null,"Jedná se o koupi z developerského projektu",null,null,null,null,null,null,null,null,null,null,null,null,null,null,null,"Jméno:",null,null,null,null,null,null,null,null,null,null,null,false]
[]
[]
[null,null,null,"Developerský projekt"]
[]
[null,null,null,null,"Je financovaný bankou?",null,null,null,null,null,"Typ:",null,null,null,null,null,null,null,null,"Název:"]
[]
[null,null,null,null,"Název DP není v seznamu, název DP:"]
[]
[]
[null,null,null,"Nemovitost č. 1",null,null,null,null,null,null,null,null,null,null,null,null,null,null,null,"Poplatek za odhad"]
[]
[null,null,null,null,"Typ nemovitosti:",null,null,null,null,null,{"$f":"SplTypNemovitosti","v":"zděná nemovitost nebo pozemek"},null,null,null,null,null,null,null,null,null,"Poplatek za odhad:",null,null,null,null,null,null,3700]
[]
[null,null,null,null,"Tržní hodnota nemovitosti:"]
[]
[null,null,null,null,"Účel úvěru:",null,null,{"$f":"Splatka!M8","v":0}]
[]
[null,null,null,null,"Další účel:",null,null,"Rekonstrukce"]
[]
[]
[]
[null,null,null,null,"LTV:",null,null,null,null,null,{"$f":"IF(nem_PocetNem=1,SumaLTV1,IF(nem_PocetNem=2,SumaLTV2,IF(nem_PocetNem=3,SumaLTV3)))","v":""}]
[]
[null,null,null,null,"Financovaná nemovitost:",null,null,null,null,null,"je v zástavě"]
[]
[null,null,null,null,"Datum ocenění:"]
[]
[null,null,null,null,"Tržní hodnota nemovitosti stanovená na základě:",null,null,null,null,null,"vyberte",null,null,null,null,null,null,null,null,null,null,null,null,null,null,null,null,{"$f":"IF(nem_LokalNem=\"\",\"\",adminNemoviost!C10)","v":""}]
[]
[]
[null,null,null,null,"* Minimální stavební náklady uvedené v ocenění financované nemovitosti"]
[null,null,null,null,"** Stavební náklady deklarované klientem (nezahrnují se náklady na koupi)"]
[null,null,null,null,"*** Hodnota zajištění na zastavené nemovitosti zajištěného zástavním právem, které nebude použitím úvěru vymazáno "]
[]
[null,null,null,"Nemovitost č. 2",null,null,null,null,null,null,null,null,null,null,null,null,null,null,null,"Poplatek za odhad"]
[]
[null,null,null,null,"Typ nemovitosti:",null,null,null,null,null,"vyberte",null,null,null,null,null,null,null,null,null,"Poplatek za odhad:"]
[]
[null,null,null,null,"Tržní hodnota nemovitosti:"]
[]
[null,null,null,null,"Účel úvěru:",null,null,{"$f":"nemUcelUveru","v":0}]
[]
[null,null,null,null,"Další účel:",null,null,"Bez dalšího účelu"]
[]
[]
[]
[null,null,null,null,"LTV:",null,null,null,null,null,{"$f":"IF(nem_PocetNem=1,SumaLTV1,IF(nem_PocetNem=2,SumaLTV2,IF(nem_PocetNem=3,SumaLTV3)))","v":""}]
[]
[null,null,null,null,"Financovaná nemovitost:",null,null,null,null,null,{"$f":"IF(nemFinancovanaNemovitost=\"\",\"\",nemFinancovanaNemovitost)","v":"je v zástavě"}]
[]
[null,null,null,null,"Datum ocenění:"]
[]
[null,null,null,null,"Tržní hodnota nemovitosti stanovená na základě:",null,null,null,null,null,"vyberte",null,null,null,null,null,null,null,null,null,null,null,null,null,null,null,null,{"$f":"IF(nem_LokalNem2=\"\",\"\",adminNemoviost!C44)","v":""}]
[]
[]
[null,null,null,null,"* Minimální stavební náklady uvedené v ocenění financované nemovitosti"]
[null,null,null,null,"** Stavební náklady deklarované klientem (nezahrnují se náklady na koupi)"]
[null,null,null,null,"*** Hodnota zajištění na zastavené nemovitosti zajištěného zástavním právem, které nebude použitím úvěru vymazáno "]
[]
[null,null,null,"Nemovitost č. 3",null,null,null,null,null,null,null,null,null,null,null,null,null,null,null,"Poplatek za odhad"]
[]
[null,null,null,null,"Typ nemovitosti:",null,null,null,null,null,"vyberte",null,null,null,null,null,null,null,null,null,"Poplatek za odhad:"]
[]
[null,null,null,null,"Tržní hodnota nemovitosti:"]
[]
[null,null,null,null,"Účel úvěru:",null,null,{"$f":"nemUcelUveru","v":0}]
[]
[null,null,null,null,"Další účel:",null,null,"Bez dalšího účelu"]
[]
[null,null,null,null,"Zástavní hodnota:"]
[]
[null,null,null,null,"LTV:",null,null,null,null,null,{"$f":"IF(nem_PocetNem=1,SumaLTV1,IF(nem_PocetNem=2,SumaLTV2,IF(nem_PocetNem=3,SumaLTV3)))","v":""}]
[]
[null,null,null,null,"Financovaná nemovitost:",null,null,null,null,null,{"$f":"IF(nemFinancovanaNemovitost=\"\",\"\",nemFinancovanaNemovitost)","v":"je v zástavě"}]
[]
[null,null,null,null,"Datum ocenění:"]
[]
[null,null,null,null,"Tržní hodnota nemovitosti stanovená na základě:",null,null,null,null,null,"vyberte",null,null,null,null,null,null,null,null,null,null,null,null,null,null,null,null,{"$f":"IF(nem_LokalNem3=\"\",\"\",adminNemoviost!C61)","v":""}]
[]
[]
[null,null,null,null,"* Minimální stavební náklady uvedené v ocenění financované nemovitosti"]
[null,null,null,null,"** Stavební náklady deklarované klientem (nezahrnují se náklady na koupi)"]
[null,null,null,null,"*** Hodnota zajištění na zastavené nemovitosti zajištěného zástavním právem, které nebude použitím úvěru vymazáno "]
[]
[null,null,null,"Přehled zdrojů pro financování nákladů stavby"]
[]
[null,null,null,null,"Minimální stavební náklady:",null,null,null,null,null,20000,null,null,null,null,null,null,null,null,null,"Výstavba bude prováděna:",null,null,null,null,"na klíč",null,null,"svépomocí"]
[]
[null,null,null,null,"Základní přehled položek  (možné hradit z hypoteční úvěru)",null,null,null,null,null,null,null,null,null,null,null,null,null,null,null,null,null,null,null,null,"jednotlivými subdodávkami"]
[]
[]
[null,null,null,"Tržní hodnota po dokončení",null,null,null,null,null,null,null,null,null,null,null,null,null,null,null,null,null,null,null,null,null,"Výpočet požadovaného % rozestavěnosti pro financování:"]
[null,null,null,null,null,null,null,null,null,null,null,null,null,null,null,"čerpání kumulovaně",null,null,null,"% vyčerpaného úvěru"]
[null,null,null,null,"% rozestavěnosti z odhadu"]
[]
[null,null,null,null,"Vlastní zdroje",null,null,null,null,null,null,null,null,null,null,{"$f":"J112","v":0},null,null,null,{"$f":"IF(AE114=0,\"\",P108/AE114)","v":""},null,null,null,null,null,"Tržní hodnota po dokončení"]
[]
[null,null,null,null,"% rozestavěnosti",null,null,null,null,{"$f":"IF(AE112=0,\"\",J108/AE112+J106)","v":""}]
[]
[null,null,null,null,"1. tranše",null,null,null,null,null,null,null,null,null,null,null,null,null,null,null,null,null,null,null,null,"Stavební náklady"]
[]
[null,null,null,null,"Vlastní zdroje",null,null,null,null,null,null,null,null,null,null,{"$f":"J112+L117","v":0},null,null,null,{"$f":"IF(AE114=0,\"\",P114/AE114)","v":""},null,null,null,null,null,"Úvěr na výstavbu"]
[]
[null,null,null,null,"% rozestavěnosti",null,null,null,null,{"$f":"IF(AE112=0,\"\",(J108+J112+J114)/AE112+J106)","v":""},null,null,null,null,null,null,null,null,null,null,null,null,null,null,null,"LTV"]
[]
[null,null,null,null,"2. tranše",null,null,null,null,null,null,null,null,null,null,null,null,null,null,null,null,null,null,null,null,"Vlastní zdroje",null,null,null,null,{"$f":"AE112-AE114","v":0}]
[]
[null,null,null,null,"Vlastní zdroje",null,null,null,null,null,null,null,null,null,null,{"$f":"J112+J118+J124","v":0},null,null,null,{"$f":"IF(AE114=0,\"\",P120/AE114)","v":""},null,null,null,null,null,"Kontrolní součty:"]
[]
[null,null,null,null,"% rozestavěnosti",null,null,null,null,{"$f":"IF(AE112=0,\"\",(J108+J112+J114+J118+J120)/AE112+J106)","v":""},null,null,null,null,null,null,null,null,null,null,null,null,null,null,null,"Investice celkem",null,null,null,null,{"$f":"IF(AE124=\"\",\"\",AE124+AE126)","v":""}]
[]
[null,null,null,null,"3. tranše",null,null,null,null,null,null,null,null,null,null,null,null,null,null,null,null,null,null,null,null,"Úvěr",null,null,null,null,{"$f":"IF(J112=\"\",\"\",J112+J118+J124+J130)","v":""}]
[]
[null,null,null,null,"Vlastní zdroje",null,null,null,null,{"$f":"AE118-J108-J114-J120","v":0},null,null,null,null,null,{"$f":"IF(J112=\"\",\"\",J112+J118+J124+J130)","v":""},null,null,null,{"$f":"IF(AE114=0,\"\",P126/AE114)","v":""},null,null,null,null,null,"Vlastní zdroje",null,null,null,null,{"$f":"J108+J114+J120+J126","v":0}]
[]
[null,null,null,null,"% rozestavěnosti",null,null,null,null,"≥ 95%",null,null,null,null,null,null,null,null,null,null,null,null,null,null,null,"Částka úvěru nerozdělená do tranší",null,null,null,null,{"$f":"IF(AE114=\"\",\"\",AE114-P120-J130)","v":""}]
[]
[null,null,null,null,"Poslední tranše",null,null,null,null,{"$f":"IF(nemUverNaVystavbu=\"\",\"\",0.05*nemUverNaVystavbu)","v":""}]
[]
[]
[null,null,null,"Procento rozestavěnosti"]
[]
[null,null,null,null,"Procento rozestavěnosti      před 1. čerpáním",null,null,null,null,{"$f":"IF(AE112=0,\"\",IF(AE114=\"\",\"\",(AE112-AE114)/AE112))","v":""}]
[]
[]
[]
[]
[null,null,null,null,"č.","Popis položky rozpočtu",null,null,null,null,null,"Počátek realizace",null,null,null,null,"Konec realizace",null,null,"Náklady (Kč)",null,null,"Použití vlastních zdrojů (Kč)",null,null,null,"Čerpání úvěru (Kč)",null,null,"Kumulovaná částka (Kč)"]
[]
[null,null,null,null,"1.","Stavební pozemek",null,null,null,null,null,null,null,null,null,null,null,null,null,null,null,null,null,null,null,null,null,null,null,{"$f":"IF(SUM(W142:AC142)=0,\"\",SUM(W142:AC142))","v":""}]
[]
[null,null,null,null,"2.","Inženýrské sítě",null,null,null,null,null,null,null,null,null,null,null,null,null,null,null,null,null,null,null,null,null,null,null,{"$f":"IF(SUM(W144:AC144)=0,\"\",SUM(W144:AC144))","v":""}]
[]
[null,null,null,null,"3.","Základy vč. zem. prací ",null,null,null,null,null,null,null,null,null,null,null,null,null,null,null,null,null,null,null,null,null,null,null,{"$f":"IF(SUM(W146:AC146)=0,\"\",SUM(W146:AC146))","v":""}]
[]
[null,null,null,null,"4.","Konstrukce (svislé , vodorovné)",null,null,null,null,null,null,null,null,null,null,null,null,null,null,null,null,null,null,null,null,null,null,null,{"$f":"IF(SUM(W148:AC148)=0,\"\",SUM(W148:AC148))","v":""}]
[]
[null,null,null,null,"5.","Střecha (krov, krytina)",null,null,null,null,null,null,null,null,null,null,null,null,null,null,null,null,null,null,null,null,null,null,null,{"$f":"IF(SUM(W150:AC150)=0,\"\",SUM(W150:AC150))","v":""}]
[]
[null,null,null,null,"6.","Klempířské konstrukce",null,null,null,null,null,null,null,null,null,null,null,null,null,null,null,null,null,null,null,null,null,null,null,{"$f":"IF(SUM(W152:AC152)=0,\"\",SUM(W152:AC152))","v":""}]
[]
[null,null,null,null,"7.","Okna a jiné vnější výplně otvorů",null,null,null,null,null,null,null,null,null,null,null,null,null,null,null,null,null,null,null,null,null,null,null,{"$f":"IF(SUM(W154:AC154)=0,\"\",SUM(W154:AC154))","v":""}]
[]
[null,null,null,null,"8.","Vnitřní dveře",null,null,null,null,null,null,null,null,null,null,null,null,null,null,null,null,null,null,null,null,null,null,null,{"$f":"IF(SUM(W156:AC156)=0,\"\",SUM(W156:AC156))","v":""}]
[]
[null,null,null,null,"9.","Vnitřní omítky, sádrokartony",null,null,null,null,null,null,null,null,null,null,null,null,null,null,null,null,null,null,null,null,null,null,null,{"$f":"IF(SUM(W158:AC158)=0,\"\",SUM(W158:AC158))","v":""}]
[]
[null,null,null,null,"10.","Obklady, dlažby",null,null,null,null,null,null,null,null,null,null,null,null,null,null,null,null,null,null,null,null,null,null,null,{"$f":"IF(SUM(W160:AC160)=0,\"\",SUM(W160:AC160))","v":""}]
[]
[null,null,null,null,"11.","Schodiště",null,null,null,null,null,null,null,null,null,null,null,null,null,null,null,null,null,null,null,null,null,null,null,{"$f":"IF(SUM(W162:AC162)=0,\"\",SUM(W162:AC162))","v":""}]
[]
[null,null,null,null,"12.","Povrchy podlah s výjimkou dlažeb",null,null,null,null,null,null,null,null,null,null,null,null,null,null,null,null,null,null,null,null,null,null,null,{"$f":"IF(SUM(W164:AC164)=0,\"\",SUM(W164:AC164))","v":""}]
[]
[null,null,null,null,"13.","Voda, kanalizace",null,null,null,null,null,null,null,null,null,null,null,null,null,null,null,null,null,null,null,null,null,null,null,{"$f":"IF(SUM(W166:AC166)=0,\"\",SUM(W166:AC166))","v":""}]
[]
[null,null,null,null,"14.","Zařizovací předměty",null,null,null,null,null,null,null,null,null,null,null,null,null,null,null,null,null,null,null,null,null,null,null,{"$f":"IF(SUM(W168:AC168)=0,\"\",SUM(W168:AC168))","v":""}]
[]
[null,null,null,null,"15.","Topení, ohřev TUV",null,null,null,null,null,null,null,null,null,null,null,null,null,null,null,null,null,null,null,null,null,null,null,{"$f":"IF(SUM(W170:AC170)=0,\"\",SUM(W170:AC170))","v":""}]
[]
[null,null,null,null,"16.","Elektro",null,null,null,null,null,null,null,null,null,null,null,null,null,null,null,null,null,null,null,null,null,null,null,{"$f":"IF(SUM(W172:AC172)=0,\"\",SUM(W172:AC172))","v":""}]
[]
[null,null,null,null,"17.","Fasáda",null,null,null,null,null,null,null,null,null,null,null,null,null,null,null,null,null,null,null,null,null,null,null,{"$f":"IF(SUM(W174:AC174)=0,\"\",SUM(W174:AC174))","v":""}]
[]
[null,null,null,null,"18.","Venkovní úpravy",null,null,null,null,null,null,null,null,null,null,null,null,null,null,null,null,null,null,null,null,null,null,null,{"$f":"IF(SUM(W176:AC176)=0,\"\",SUM(W176:AC176))","v":""}]
[]
[null,null,null,null,"19.","Ostatní stavební náklady",null,null,null,null,null,null,null,null,null,null,null,null,null,null,null,null,null,null,null,null,null,null,null,{"$f":"IF(SUM(W178:AC178)=0,\"\",SUM(W178:AC178))","v":""}]
[]
[null,null,null,null,"20.","Rezerva",null,null,null,null,null,null,null,null,null,null,null,null,null,null,null,null,null,null,null,null,null,null,null,{"$f":"IF(SUM(W180:AC180)=0,\"\",SUM(W180:AC180))","v":""}]
[]
[null,null,null,null,"Celkem",null,null,null,null,null,null,null,null,null,null,null,null,null,null,{"$f":"IF(SUM(T142:V180)=0,\"\",SUM(T142:V180))","v":""},null,null,{"$f":"IF(SUM(W142:Z180)=0,\"\",SUM(W142:Z180))","v":""},null,null,null,{"$f":"IF(SUM(AA142:AC180)=0,\"\",SUM(AA142:AC180))","v":""},null,null,{"$f":"IF(SUM(W182:AC182)=0,\"\",SUM(W182:AC182))","v":""}]

{"sheet":"adminNemoviost","index":21,"n_rows":81,"n_cols":15,"rows_kept":81,"cut":false,"hidden":false,"merged":[[44,9,44,10],[44,11,44,12],[44,13,44,14],[61,0,62,0],[61,1,61,2],[61,3,61,4],[61,5,61,6],[61,7,61,8],[61,9,61,10],[61,11,61,12],[61,13,61,14],[44,0,45,0],[44,1,44,2],[44,3,44,4],[44,5,44,6],[44,7,44,8],[10,11,10,12],[10,13,10,14],[35,3,37,3],[10,0,11,0],[10,1,10,2],[10,3,10,4],[10,5,10,6],[10,7,10,8],[10,9,10,10]]}
["Byt-revit.panel","není","v zástavě","Praha, Brno"]
["Byt-nerevit.panel","koupě","není v zástavě","ostatní"]
["Byt ostatní","výstavba / rekonstrukce"]
["Byt družstevní","vypořádání majetkových poměrů","externího ocenění s verifikací"]
["Pozemek rezid.","splacení půjčky / úvěru","externího ocenění bez verifikace"]
["Pozemek nerezid.","zpětné proplacení finančních prostředků","interního ocenění"]
["Rekreační objekt","neúčelý úvěr"]
["Rodinný dům"]
[]
["Přepočítaná tržní hodnota nemovitosti",{"$f":"trzniHodnotaNemovistosti","v":0},{"$f":"B10-(B10*D19)","v":0}]
["Rok ocenění / Typ nemovitosti","2006 a starší",null,2007,null,2008,null,2009,null,2010,null,2011,null,2012]
[null,"Praha, Brno","ostatní","Praha, Brno","ostatní","Praha, Brno","ostatní","Praha, Brno","ostatní","Praha, Brno","ostatní","Praha, Brno","ostatní","Praha, Brno","ostatní"]
["Rodinný dům",0,0,0.1,0.125,0.15,0.17499999999999999,0.15,0.17499999999999999,0.05,0.05,0.05,0.05,0,0]
["Pozemek",0,0,0,0,0,0,0,0,0,0,0,0.05,0,0]
["Byt-cihla",0,0,0.125,0.125,0.2,0.17499999999999999,0.17499999999999999,0.15,0.05,0.05,0.05,0.05,0,0]
["Byt-panel",0,0,0.125,0.125,0.22500000000000001,0.22500000000000001,0.2,0.17499999999999999,0.05,0.05,0.05,0.05,0,0]
[]
[{"$f":"IF(nem_TypNem=\"Rodinný dům\",1,IF(nem_TypNem=\"Pozemek\",2,IF(nem_TypNem=\"Byt-cihla\",3,4)))","v":4},null,"TH",{"$f":"trzniHodnotaNemovistosti","v":0},2012,"2012-01-01","2012-12-31",1,1]
[{"$f":"IF(nem_LokalNem=\"Praha, Brno\",1,2)","v":2},null,"%",{"$f":"IF(A22=B11,B13,IF((AND(A22=D11,A19=I18,A18=H18)),D13,IF((AND(A22=D11,A19=I18,A18=H19)),D14,IF((AND(A22=D11,A19=I18,A18=H20)),D15,IF((AND(A22=D11,A19=I18,A18=H21)),D16,IF((AND(A22=D11,A19=I19,A18=H18)),E13,IF((AND(A22=D11,A19=I19,A18=H19)),E14,IF((AND(A22=D11,A19=I19,A18=H20)),E15,IF((AND(A22=D11,A19=I19,A18=H21)),E16,IF((AND(A22=F11,A19=I18,A18=H18)),F13,IF((AND(A22=F11,A19=I18,A18=H19)),F14,IF((AND(A22=F11,A19=I18,A18=H20)),F15,IF((AND(A22=F11,A19=I18,A18=H21)),F16,IF((AND(A22=F11,A19=I19,A18=H18)),G13,IF((AND(A22=F11,A19=I19,A18=H19)),G14,IF((AND(A22=F11,A19=I19,A18=H20)),G15,IF((AND(A22=F11,A19=I19,A18=H21)),G16,IF((AND(A22=H11,A19=I18,A18=H18)),H13,IF((AND(A22=H11,A19=I18,A18=H19)),H14,IF((AND(A22=H11,A19=I18,A18=H20)),H15,IF((AND(A22=H11,A19=I18,A18=H21)),H16,IF((AND(A22=H11,A19=I19,A18=H18)),I13,IF((AND(A22=H11,A19=I19,A18=H19)),I14,IF((AND(A22=H11,A19=I19,A18=H20)),I15,IF((AND(A22=H11,A19=I19,A18=H21)),I16,IF((AND(A22=J11,A18=H18)),J13,IF((AND(A22=J11,A18=H19)),J14,IF((AND(A22=J11,A18=H20)),J15,IF((AND(A22=J11,A18=H21)),J16,IF((AND(A22=L11,A19=I18,A18=H18)),L13,IF((AND(A22=L11,A19=I18,A18=H19)),L14,IF((AND(A22=L11,A19=I18,A18=H20)),L15,IF((AND(A22=L11,A19=I18,A18=H21)),L16,IF((AND(A22=L11,A19=I19)),M13,IF(A22=N11,N13,0)))))))))))))))))))))))))))))))))))","v":0},2011,"2011-01-01","2011-12-31",2,2]
[{"$f":"nemDatumOceneni","v":"00:00:00"},null,null,null,2010,"2010-01-01","2010-12-31",3]
[null,null,null,null,2009,"2009-01-01","2009-12-31",4]
[{"$f":"IF((AND(A20<=G18,A20>=F18)),E18,IF((AND(A20<=G19,A20>=F19)),E19,IF((AND(A20<=G20,A20>=F20)),E20,IF((AND(A20<=G21,A20>=F21)),E21,IF((AND(A20<=G22,A20>=F22)),E22,IF((AND(A20<=F23,A20>=G23)),E23,IF((AND(A20<=G24,A20>=F24)),E24,\"mladší\")))))))","v":"mladší"},null,null,null,2008,"2008-01-01","2008-12-31"]
[null,null,null,null,2007,"2007-01-01","2007-12-31"]
[null,null,null,null,"2006 a starší","1900-01-01","2006-12-31"]
["vyberte"]
["Bytová jednotka"]
["Pozemek rezid."]
["Pozemek nerezid."]
["Rekreační objekt"]
["Rodinný dům"]
[]
[]
[]
[]
["vyberte","vyberte","vyberte"]
["Externí odhad - Remedy","Externí odhad - Remedy","Externí odhad - Remedy","ostatní"]
["Externí odhad s verifikací","Externí odhad s verifikací","Externí odhad s verifikací",null,{"$f":"IF(HlavUcelUveru=\"Refinancování úvěru – standard\",1,IF(HlavUcelUveru=\"Refinancování úvěru – zjednodušené\",1,IF(HlavUcelUveru=\"Koupě\",2,3)))","v":3},null,{"$f":"IF(adminNemoviost!E37=1,adminNemoviost!C35:C40,IF(adminNemoviost!E37=2,adminNemoviost!B35:B39,adminNemoviost!A35:A38))","v":"Externí odhad s verifikací"}]
["Interní odhad","Interní odhad","Interní odhad"]
[null,"Kupní smlouva","Původní odhad","Koupě"]
[null,null,"Kupní smlouva","Refinancování úvěru – zjednodušené"]
[null,null,null,"Refinancování úvěru – standard"]
[]
["Nem2"]
["Přepočítaná tržní hodnota nemovitosti",{"$f":"trzniHodnotaNemovistosti2","v":0},{"$f":"B44-(B44*D53)","v":0}]
["Rok ocenění / Typ nemovitosti","2006 a starší",null,2007,null,2008,null,2009,null,2010,null,2011,null,2012]
[null,"Praha, Brno","ostatní","Praha, Brno","ostatní","Praha, Brno","ostatní","Praha, Brno","ostatní","Praha, Brno","ostatní","Praha, Brno","ostatní","Praha, Brno","ostatní"]
["Rodinný dům",0,0,0.1,0.125,0.15,0.17499999999999999,0.15,0.17499999999999999,0.05,0.05,0.05,0.05,0,0]
["Pozemek",0,0,0,0,0,0,0,0,0,0,0,0.05,0,0]
["Byt-cihla",0,0,0.125,0.125,0.2,0.17499999999999999,0.17499999999999999,0.15,0.05,0.05,0.05,0.05,0,0]
["Byt-panel",0,0,0.125,0.125,0.22500000000000001,0.22500000000000001,0.2,0.17499999999999999,0.05,0.05,0.05,0.05,0,0]
[]
[{"$f":"IF(nem_TypNem2=\"Rodinný dům\",1,IF(nem_TypNem2=\"Pozemek\",2,IF(nem_TypNem2=\"Byt-cihla\",3,4)))","v":4},null,"TH",{"$f":"trzniHodnotaNemovistosti2","v":0},2012,"2012-01-01","2012-12-31",1,1]
[{"$f":"IF(nem_LokalNem2=\"Praha, Brno\",1,2)","v":2},null,"%",{"$f":"IF(A56=B45,B47,IF((AND(A56=D45,A53=I52,A52=H52)),D47,IF((AND(A56=D45,A53=I52,A52=H53)),D48,IF((AND(A56=D45,A53=I52,A52=H54)),D49,IF((AND(A56=D45,A53=I52,A52=H55)),D50,IF((AND(A56=D45,A53=I53,A52=H52)),E47,IF((AND(A56=D45,A53=I53,A52=H53)),E48,IF((AND(A56=D45,A53=I53,A52=H54)),E49,IF((AND(A56=D45,A53=I53,A52=H55)),E50,IF((AND(A56=F45,A53=I52,A52=H52)),F47,IF((AND(A56=F45,A53=I52,A52=H53)),F48,IF((AND(A56=F45,A53=I52,A52=H54)),F49,IF((AND(A56=F45,A53=I52,A52=H55)),F50,IF((AND(A56=F45,A53=I53,A52=H52)),G47,IF((AND(A56=F45,A53=I53,A52=H53)),G48,IF((AND(A56=F45,A53=I53,A52=H54)),G49,IF((AND(A56=F45,A53=I53,A52=H55)),G50,IF((AND(A56=H45,A53=I52,A52=H52)),H47,IF((AND(A56=H45,A53=I52,A52=H53)),H48,IF((AND(A56=H45,A53=I52,A52=H54)),H49,IF((AND(A56=H45,A53=I52,A52=H55)),H50,IF((AND(A56=H45,A53=I53,A52=H52)),I47,IF((AND(A56=H45,A53=I53,A52=H53)),I48,IF((AND(A56=H45,A53=I53,A52=H54)),I49,IF((AND(A56=H45,A53=I53,A52=H55)),I50,IF((AND(A56=J45,A52=H52)),J47,IF((AND(A56=J45,A52=H53)),J48,IF((AND(A56=J45,A52=H54)),J49,IF((AND(A56=J45,A52=H55)),J50,IF((AND(A56=L45,A53=I52,A52=H52)),L47,IF((AND(A56=L45,A53=I52,A52=H53)),L48,IF((AND(A56=L45,A53=I52,A52=H54)),L49,IF((AND(A56=L45,A53=I52,A52=H55)),L50,IF((AND(A56=L45,A53=I53)),M47,IF(A56=N45,N47,0)))))))))))))))))))))))))))))))))))","v":0},2011,"2011-01-01","2011-12-31",2,2]
[{"$f":"nemDatumOceneni2","v":"00:00:00"},null,null,null,2010,"2010-01-01","2010-12-31",3]
[null,null,null,null,2009,"2009-01-01","2009-12-31",4]
[{"$f":"IF((AND(A54<=G52,A54>=F52)),E52,IF((AND(A54<=G53,A54>=F53)),E53,IF((AND(A54<=G54,A54>=F54)),E54,IF((AND(A54<=G55,A54>=F55)),E55,IF((AND(A54<=G56,A54>=F56)),E56,IF((AND(A54<=F57,A54>=G57)),E57,IF((AND(A54<=G58,A54>=F58)),E58,\"mladší\")))))))","v":"mladší"},null,null,null,2008,"2008-01-01","2008-12-31"]
[null,null,null,null,2007,"2007-01-01","2007-12-31"]
[null,null,null,null,"2006 a starší","1900-01-01","2006-12-31"]
[]
["Nem3"]
["Přepočítaná tržní hodnota nemovitosti",{"$f":"trzniHodnotaNemovistosti3","v":0},{"$f":"B61-(B61*D70)","v":0}]
["Rok ocenění / Typ nemovitosti","2006 a starší",null,2007,null,2008,null,2009,null,2010,null,2011,null,2012]
[null,"Praha, Brno","ostatní","Praha, Brno","ostatní","Praha, Brno","ostatní","Praha, Brno","ostatní","Praha, Brno","ostatní","Praha, Brno","ostatní","Praha, Brno","ostatní"]
["Rodinný dům",0,0,0.1,0.125,0.15,0.17499999999999999,0.15,0.17499999999999999,0.05,0.05,0.05,0.05,0,0]
["Pozemek",0,0,0,0,0,0,0,0,0,0,0,0.05,0,0]
["Byt-cihla",0,0,0.125,0.125,0.2,0.17499999999999999,0.17499999999999999,0.15,0.05,0.05,0.05,0.05,0,0]
["Byt-panel",0,0,0.125,0.125,0.22500000000000001,0.22500000000000001,0.2,0.17499999999999999,0.05,0.05,0.05,0.05,0,0]
[]
[{"$f":"IF(nem_TypNem3=\"Rodinný dům\",1,IF(nem_TypNem3=\"Pozemek\",2,IF(nem_TypNem3=\"Byt-cihla\",3,4)))","v":4},null,"TH",{"$f":"trzniHodnotaNemovistosti3","v":0},2012,"2012-01-01","2012-12-31",1,1]
[{"$f":"IF(nem_LokalNem3=\"Praha, Brno\",1,2)","v":2},null,"%",{"$f":"IF(A73=B62,B64,IF((AND(A73=D62,A70=I69,A69=H69)),D64,IF((AND(A73=D62,A70=I69,A69=H70)),D65,IF((AND(A73=D62,A70=I69,A69=H71)),D66,IF((AND(A73=D62,A70=I69,A69=H72)),D67,IF((AND(A73=D62,A70=I70,A69=H69)),E64,IF((AND(A73=D62,A70=I70,A69=H70)),E65,IF((AND(A73=D62,A70=I70,A69=H71)),E66,IF((AND(A73=D62,A70=I70,A69=H72)),E67,IF((AND(A73=F62,A70=I69,A69=H69)),F64,IF((AND(A73=F62,A70=I69,A69=H70)),F65,IF((AND(A73=F62,A70=I69,A69=H71)),F66,IF((AND(A73=F62,A70=I69,A69=H72)),F67,IF((AND(A73=F62,A70=I70,A69=H69)),G64,IF((AND(A73=F62,A70=I70,A69=H70)),G65,IF((AND(A73=F62,A70=I70,A69=H71)),G66,IF((AND(A73=F62,A70=I70,A69=H72)),G67,IF((AND(A73=H62,A70=I69,A69=H69)),H64,IF((AND(A73=H62,A70=I69,A69=H70)),H65,IF((AND(A73=H62,A70=I69,A69=H71)),H66,IF((AND(A73=H62,A70=I69,A69=H72)),H67,IF((AND(A73=H62,A70=I70,A69=H69)),I64,IF((AND(A73=H62,A70=I70,A69=H70)),I65,IF((AND(A73=H62,A70=I70,A69=H71)),I66,IF((AND(A73=H62,A70=I70,A69=H72)),I67,IF((AND(A73=J62,A69=H69)),J64,IF((AND(A73=J62,A69=H70)),J65,IF((AND(A73=J62,A69=H71)),J66,IF((AND(A73=J62,A69=H72)),J67,IF((AND(A73=L62,A70=I69,A69=H69)),L64,IF((AND(A73=L62,A70=I69,A69=H70)),L65,IF((AND(A73=L62,A70=I69,A69=H71)),L66,IF((AND(A73=L62,A70=I69,A69=H72)),L67,IF((AND(A73=L62,A70=I70)),M64,IF(A73=N62,N64,0)))))))))))))))))))))))))))))))))))","v":0},2011,"2011-01-01","2011-12-31",2,2]
[{"$f":"nemDatumOceneni3","v":"00:00:00"},null,null,null,2010,"2010-01-01","2010-12-31",3]
[null,null,null,null,2009,"2009-01-01","2009-12-31",4]
[{"$f":"IF((AND(A71<=G69,A71>=F69)),E69,IF((AND(A71<=G70,A71>=F70)),E70,IF((AND(A71<=G71,A71>=F71)),E71,IF((AND(A71<=G72,A71>=F72)),E72,IF((AND(A71<=G73,A71>=F73)),E73,IF((AND(A71<=F74,A71>=G74)),E74,IF((AND(A71<=G75,A71>=F75)),E75,\"mladší\")))))))","v":"mladší"},null,null,null,2008,"2008-01-01","2008-12-31"]
[null,null,null,null,2007,"2007-01-01","2007-12-31"]
[null,null,null,null,"2006 a starší","1900-01-01","2006-12-31"]
[]
[]
["LTV","Hodnota","Zaokr_Hodnota"]
["LTV1",{"$f":"IF(trzniHodnotaNemovistosti=\"\",\"\",(VyseUveruZaklad+vyseUveru2)/trzniHodnotaNemovistosti)","v":""},{"$f":"IF(admLTV1=\"\",\"\",ROUNDUP(admLTV1,3))","v":""}]
["LTV2",{"$f":"IF(trzniHodnotaNemovistosti2=\"\",\"\",(VyseUveruZaklad+vyseUveru2)/(trzniHodnotaNemovistosti2+trzniHodnotaNemovistosti))","v":""},{"$f":"IF(admLTV2=\"\",\"\",ROUNDUP(admLTV2,3))","v":""}]
["LTV3",{"$f":"IF(trzniHodnotaNemovistosti3=\"\",\"\",(VyseUveruZaklad+vyseUveru2)/(trzniHodnotaNemovistosti3+trzniHodnotaNemovistosti2+trzniHodnotaNemovistosti))","v":""},{"$f":"IF(admLTV3=\"\",\"\",ROUNDUP(admLTV3,3))","v":""}]

{"sheet":"Protokol","index":22,"n_rows":172,"n_cols":25,"rows_kept":172,"cut":false,"hidden":false,"merged":[[114,5,116,5]]}
[]
[null,null,"banker",null,null,null,null,null,null,null,null,null,null,null,null,null,"DP - ano, Financ. bankou - ano",null,null,"DP - ne",null,null,"DP - ano, Financ. bankou - ne"]
[null,null,"bPobocka",{"$f":"zPobocka","v":0},"ID Bankéře (extra tabulka na lokálním disku bankéře) / Nabídka",null,null,null,null,null,null,null,null,null,null,null,"Nemovitost",null,null,"Nemovitost",null,null,"Nemovitost"]
[null,null,"bBanker",{"$f":"zPracovnikBanky","v":0},"ID Bankéře (extra tabulka na lokálním disku bankéře) / Nabídka",null,null,null,null,null,null,null,null,null,null,null,"nem_PocetNem",{"$f":"nem_PocetNem","v":1},{"$f":"IF(R4=0,TRUE,FALSE)","v":false},"nem_PocetNem",{"$f":"nem_PocetNem","v":1},{"$f":"IF(U4=0,TRUE,FALSE)","v":false},"nem_PocetNem",{"$f":"nem_PocetNem","v":1},{"$f":"IF(X4=0,TRUE,FALSE)","v":false}]
[null,null,"bVyseUveru",{"$f":"IF(SlevaCardif=\"Ano\",(IF(VyseUveru=0,\"\",VyseUveru)),(IF(VyseUveruZaklad+vyseUveru2=0,\"\",VyseUveruZaklad+vyseUveru2)))","v":2060000},"Splátka",null,null,null,null,null,null,null,null,null,null,null,"nem_TypKlienta",{"$f":"nem_TypKlienta","v":0},{"$f":"FALSE","v":false},"nem_TypKlienta",{"$f":"nem_TypKlienta","v":0},{"$f":"FALSE","v":false},"nem_TypKlienta",{"$f":"nem_TypKlienta","v":0},{"$f":"FALSE","v":false}]
[null,null,"DatumPodaniZadosti",{"$f":"zadDatum","v":0},"To pole je vyplňovaný i s místem",null,null,null,null,null,null,null,null,null,null,null,"nem_DPFinBank",{"$f":"nem_DPFinBank","v":0},{"$f":"IF(R6=0,TRUE,FALSE)","v":true},"nemTypNemovitosti",{"$f":"nemTypNemovitosti","v":"zděná nemovitost nebo pozemek"},{"$f":"IF(U6=0,TRUE,FALSE)","v":false},"nem_DPFinBank",{"$f":"nem_DPFinBank","v":0},{"$f":"IF(X6=0,TRUE,FALSE)","v":true}]
[null,null,"Typ_uveru",{"$f":"TypHypoteky","v":"Hypoteční úvěr účelový rezidenční Individual"},"Splátka",null,null,null,null,null,null,null,null,null,null,null,"nem_TypDP",{"$f":"nem_TypDP","v":0},true,"trzniHodnotaNemovistosti",{"$f":"trzniHodnotaNemovistosti","v":0},true,"nemTypNemovitosti",{"$f":"nemTypNemovitosti","v":"zděná nemovitost nebo pozemek"},false]
[null,null,"HlavUcelUveru",{"$f":"HlavUcelUveru","v":0},"Splátka",null,null,null,null,null,null,null,null,null,null,null,"nem_NazevDP",{"$f":"IF(nem_NazevDP=\"\",DP_JinyNazev,nem_NazevDP)","v":0},true,"nemDalsiUcel",{"$f":"nemDalsiUcel","v":"Rekonstrukce"},false,"trzniHodnotaNemovistosti",{"$f":"trzniHodnotaNemovistosti","v":0},true]
[null,null,"TypUrokSazby",{"$f":"Fix_obdobi","v":"3 roky"},"Splátka",null,null,null,"Poplatky:",null,null,null,null,null,null,null,"nemTypNemovitosti",{"$f":"nemTypNemovitosti","v":"zděná nemovitost nebo pozemek"},false,"zastavniHodnota",{"$f":"zastavniHodnota","v":0},{"$f":"FALSE","v":false},"nemDalsiUcel",{"$f":"nemDalsiUcel","v":"Rekonstrukce"},false]
[null,null,"bTypSlevy1",null,"Splátka",null,null,null,null,null,null,null,null,null,null,null,"trzniHodnotaNemovistosti",{"$f":"trzniHodnotaNemovistosti","v":0},true,"LTV",{"$f":"LTV","v":""},false,"zastavniHodnota",{"$f":"zastavniHodnota","v":0},{"$f":"FALSE","v":false}]
[null,null,"bVyseSlevy1",{"$f":"I16","v":""},"Splátka","pokračování dole",null,null,"NnV","Posk","Odhad",null,null,null,null,null,"nemDalsiUcel",{"$f":"nemDalsiUcel","v":"Rekonstrukce"},false,"nemFinancovanaNemovitost",{"$f":"nemFinancovanaNemovitost","v":"je v zástavě"},false,"LTV",{"$f":"LTV","v":""},false]
[null,null,"KC",null,null,null,null,null,{"$f":"splPoplNnV","v":1500},{"$f":"splPoplPosk","v":2500},{"$f":"splPoplOdhad","v":3700},null,null,null,null,null,"zastavniHodnota",{"$f":"zastavniHodnota","v":0},{"$f":"FALSE","v":false},"nemDatumOceneni",{"$f":"nemDatumOceneni","v":0},true,"nemFinancovanaNemovitost",{"$f":"nemFinancovanaNemovitost","v":"je v zástavě"},false]
[null,null,"kcDobaCerpani",{"$f":"DatumDocerpani","v":0},"Splátka",null,null,null,null,null,null,null,null,null,null,null,"LTV",{"$f":"LTV","v":""},false,"nemTrzniHodnota",{"$f":"nemTrzniHodnota","v":"vyberte"},false,"nemDatumOceneni",{"$f":"nemDatumOceneni","v":0},true]
[null,null,"kcDobaSplaceni",{"$f":"DobaSplatnosti","v":25},"Splátka",null,null,null,"Sleva na poplatcích",null,null,null,null,null,null,null,"nemFinancovanaNemovitost",{"$f":"nemFinancovanaNemovitost","v":"je v zástavě"},false,"minimalniStavedniNaklady",{"$f":"minimalniStavedniNaklady","v":{"$error":"#NAME?"}},{"$f":"FALSE","v":false},"nemTrzniHodnota",{"$f":"nemTrzniHodnota","v":"vyberte"},false]
[null,null,"kcDatumKonecFixniObdobi",{"$f":"KonecFixu","v":"2019-02-24"},"Splátka",null,null,null,"NnV","Posk","sazba",null,null,null,null,null,"nemDatumOceneni",{"$f":"nemDatumOceneni","v":0},true,"stavebniNaklady",{"$f":"stavebniNaklady","v":0},{"$f":"FALSE","v":false},"minimalniStavedniNaklady",{"$f":"minimalniStavedniNaklady","v":{"$error":"#NAME?"}},{"$f":"FALSE","v":false}]
[null,null,"kcDatumSplatnostiFIN",{"$f":"KonecUveru","v":"2016-07-25"},"Splátka",null,null,null,{"$f":"IF(I19=0,\"\",((I12-I19)/I12)*100)","v":""},{"$f":"IF(J19=0,\"\",((J12-J19)/J12)*100)","v":""},{"$f":"IF(SlevaNaTvrdo=0,\"\",SlevaNaTvrdo*100)","v":""},null,null,null,null,null,"nemTrzniHodnota",{"$f":"nemTrzniHodnota","v":"vyberte"},false,"hodnotaZavazku",{"$f":"hodnotaZavazku","v":0},{"$f":"FALSE","v":false},"stavebniNaklady",{"$f":"stavebniNaklady","v":0},{"$f":"FALSE","v":false}]
[null,null,"kc3PJmenoPrijmeni",{"$f":"zTotoznostOveril","v":0},"Žádost",null,null,null,null,null,null,null,null,null,null,null,"minimalniStavedniNaklady",{"$f":"minimalniStavedniNaklady","v":{"$error":"#NAME?"}},{"$f":"FALSE","v":false},"nemNemovitost",{"$f":"nemNemovitost","v":3700},{"$f":"FALSE","v":false},"hodnotaZavazku",{"$f":"hodnotaZavazku","v":0},{"$f":"FALSE","v":false}]
[null,null,"IC_RC_3P",{"$f":"zIcMaklere","v":0},"Žádost",null,null,null,"Výsledek",null,null,null,null,null,null,null,"stavebniNaklady",{"$f":"stavebniNaklady","v":0},{"$f":"FALSE","v":false},"nem_TypNem",{"$f":"nem_TypNem","v":0},{"$f":"FALSE","v":false},"nemNemovitost",{"$f":"nemNemovitost","v":3700},{"$f":"FALSE","v":false}]
[null,null,"kcCountrySpread",null,"Splátka",null,null,null,{"$f":"splPoplNnVx","v":0},{"$f":"Splatka!E60","v":0},{"$f":"Splatka!G60","v":0},null,null,null,null,null,"hodnotaZavazku",{"$f":"hodnotaZavazku","v":0},{"$f":"FALSE","v":false},"nem_LokalNem",{"$f":"nem_LokalNem","v":0},{"$f":"FALSE","v":false},"nem_TypNem",{"$f":"nem_TypNem","v":0},{"$f":"FALSE","v":false}]
[null,null,"kcSpecialRefinancSpread",{"$f":"SplSrs","v":1E-4},"Splátka",null,null,null,null,null,null,null,null,null,null,null,"nemNemovitost",{"$f":"nemNemovitost","v":3700},{"$f":"FALSE","v":false},{"$f":"OR(V4:V19)","v":true},null,null,"nem_LokalNem",{"$f":"nem_LokalNem","v":0},{"$f":"FALSE","v":false}]
[null,null,"kcRizikMarze",{"$f":"SplRm","v":8.4000000000000012E-3},"Splátka",null,null,null,null,null,null,null,null,null,null,null,"nem_TypNem",{"$f":"nem_TypNem","v":0},{"$f":"FALSE","v":false},null,null,null,"DP_JinyNazev",{"$f":"DP_JinyNazev","v":0},true]
[null,null,"kcObchodMarze",{"$f":"SplOm","v":5.1799999999999999E-2},"Splátka",null,null,null,null,null,null,null,null,null,null,null,"nem_LokalNem",{"$f":"nem_LokalNem","v":0},{"$f":"FALSE","v":false},null,null,null,{"$f":"OR(Y4:Y21)","v":true}]
[null,null,"kcVyjimkaMarketing",{"$f":"SplMarketingSleva","v":0},"Splátka",null,null,null,null,null,null,null,null,null,null,null,"checkbox - DP",true]
[null,null,"kc_Ucet",{"$f":"SlevaUcet","v":"Ano"},"Splátka",null,null,null,null,null,null,null,null,null,null,null,{"$f":"OR(S4:S22)","v":true}]
[null,null,"kc_KK",{"$f":"SlevaKarta","v":"Ano"},"Splátka"]
[null,null,"kc_CPI",{"$f":"SlevaCardif","v":"Ano"},"Splátka"]
[null,null,"CPI_Povinne",null,"Splátka","Možná nějaký admin - výpočet je \"odněkud hlídán\", takže musí existovat :-)",null,null,null,null,null,null,null,null,null,null,"Doplneni"]
[null,null,"Typ_CPI",{"$f":"CardifTyp","v":"Navýšením úvěru"},"Splátka",null,null,null,null,null,null,null,null,null,null,null,"dopPracB3",{"$f":"zPracovnikBanky","v":0},{"$f":"IF(R28=0,TRUE,FALSE)","v":true}]
[null,null,"kc_akceptPrijmy_zadatel",{"$f":"adminPrijmyZadatel","v":0},"Bonita",null,null,null,null,null,null,null,null,null,null,null,"dopPobocka3",{"$f":"zPobocka","v":0},{"$f":"IF(R29=0,TRUE,FALSE)","v":true}]
[null,null,"kc_Z1_Jmeno",{"$f":"zadJmeno&\" \"&zadPrijmeni","v":" "},"Žádost",null,null,null,null,null,null,null,null,null,null,null,"dopNDG3",{"$f":"zNdg","v":0},true]
[null,null,"kc_Z1_RC",{"$f":"zadRC","v":0},"Žádost",null,null,null,null,null,null,null,null,null,null,null,"dopJmeno",{"$f":"SplatkaJmenoKlienta","v":""},false]
[null,null,"kc_Z1_Telefon",{"$f":"zadTelefon","v":0},"Žádost",null,null,null,null,null,null,null,null,null,null,null,"dopPrijmeni",{"$f":"dopPrijmeni","v":""},false]
[null,null,"kc_Z1_CBskore",null,null,null,null,null,null,null,null,null,null,null,null,null,"dopRC",{"$f":"dopRC","v":""},false]
[null,null,"kc_Z1_SJM",{"$f":"IF(dopRodinnyStav21<>\"\",textSJM1,IF(dopRodinnyStav23<>\"\",textSJM2,\"\"))","v":""},"Doplnění",null,null,null,null,null,null,null,null,null,null,null,"dopStPris",{"$f":"dopStPris","v":0},true]
[null,null,"kc_Z1_ICzam",{"$f":"dopIC","v":0},"Doplnění",null,null,null,null,null,null,null,null,null,null,null,"dopRodinnyStav1",{"$f":"dopRodinnyStav1","v":0},{"$f":"FALSE","v":false},{"$f":"IF(R35=0,FALSE,TRUE)","v":false},{"$f":"OR(T35:T39)","v":false}]
[null,null,"kc_Z1_RodStav",{"$f":"IF(dopRodinnyStav1<>\"\",textRS1,IF(dopRodinnyStav2<>\"\",textRS2,IF(dopRodinnyStav3<>\"\",textRS3,IF(dopRodinnyStav4<>\"\",textRS4,IF(dopRodinnyStav5<>\"\",textRS5,\"\")))))","v":""},"Doplnění",null,null,null,null,null,null,null,null,null,null,null,"dopRodinnyStav2",{"$f":"dopRodinnyStav2","v":0},{"$f":"FALSE","v":false},{"$f":"IF(R36=0,FALSE,TRUE)","v":false}]
[null,null,"kc_Z1_ZpusBydl",{"$f":"IF(dopBytovePomery1<>\"\",textBP1,IF(dopBytovePomery2<>\"\",textBP2,IF(dopBytovePomery3<>\"\",textBP3,IF(dopBytovePomery4<>\"\",textBP3,IF(dopBytovePomery5<>\"\",textBP5,\"\")))))","v":""},"Doplnění",null,null,null,null,null,null,null,null,null,null,null,"dopRodinnyStav3",{"$f":"dopRodinnyStav3","v":0},{"$f":"FALSE","v":false},false]
[null,null,"kc_Z1_Vzdelani",{"$f":"IF(dopVzdelani1<>\"\",textVzd1,IF(dopVzdelani¨2<>\"\",textVzd2,IF(dopVzdelani4<>\"\",textVzd3,IF(dopVzdelani5<>\"\",textVzd4,IF(dopVzdelani6<>\"\",textVzd5,IF(dopVzdelani7<>\"\",textVzd6,\"\"))))))","v":""},"Doplnění",null,null,null,null,null,null,null,null,null,null,null,"dopRodinnyStav4",{"$f":"dopRodinnyStav4","v":0},{"$f":"FALSE","v":false},false]
[null,null,"kc_Z1_PocetDosp",{"$f":"dopDosp","v":1},"Doplnění",null,null,null,null,null,null,null,null,null,null,null,"dopRodinnyStav5",{"$f":"dopRodinnyStav5","v":0},{"$f":"IF(U35=TRUE,FALSE,TRUE)","v":true},false]
[null,null,"kc_Z1_PocetDeti",{"$f":"dopDeti","v":0},"Doplnění",null,null,null,null,null,null,null,null,null,null,null,"dopVzdelani1",{"$f":"dopVzdelani1","v":0},{"$f":"FALSE","v":false},false,{"$f":"OR(T40:T45)","v":false}]
[null,null,"kc_Z1_PocetMZam",{"$f":"dopSoucZam","v":0},"Doplnění",null,null,null,null,null,null,null,null,null,null,null,"dopVzdelani¨2",{"$f":"dopVzdelani¨2","v":0},{"$f":"FALSE","v":false},false]
[null,null,"kc_Z2_Jmeno",{"$f":"dopJmeno2&\" \"&dopPrijmeni2","v":" "},"Doplnění",null,null,null,null,null,null,null,null,null,null,null,"dopVzdelani4",{"$f":"dopVzdelani4","v":0},{"$f":"FALSE","v":false},false]
[null,null,"kc_Z2_RC",{"$f":"dopRC2","v":""},"Doplnění",null,null,null,null,null,null,null,null,null,null,null,"dopVzdelani5",{"$f":"dopVzdelani5","v":0},{"$f":"FALSE","v":false},false]
[null,null,"kc_Z2_Telefon",{"$f":"zadTelefon2","v":0},"Doplnění",null,null,null,null,null,null,null,null,null,null,null,"dopVzdelani6",{"$f":"dopVzdelani6","v":0},{"$f":"FALSE","v":false},false]
[null,null,"kc_Z2_CBskore",null,null,null,null,null,null,null,null,null,null,null,null,null,"dopVzdelani7",{"$f":"dopVzdelani7","v":0},{"$f":"IF(U40=TRUE,FALSE,TRUE)","v":true},false]
[null,null,"kc_Z2_SJM",{"$f":"IF(dopRodinnyStav21_2<>\"\",textSJM1,IF(dopRodinnyStav23_2<>\"\",textSJM2,\"\"))","v":""},"Doplnění",null,null,null,null,null,null,null,null,null,null,null,"dopZvlastniVztah1",{"$f":"dopZvlastniVztah1","v":0},{"$f":"FALSE","v":false},false,{"$f":"OR(T46:T47)","v":false}]
[null,null,"kc_Z2_ICzam",{"$f":"dopIC2","v":0},"Doplnění",null,null,null,null,null,null,null,null,null,null,null,"dopZvlastniVztah2",{"$f":"dopZvlastniVztah2","v":0},{"$f":"IF(U46=TRUE,FALSE,TRUE)","v":true},false]
[null,null,"kc_Z2_RodStav",{"$f":"IF(dopRodinnyStav1_2<>\"\",textRS1,IF(dopRodinnyStav2_2<>\"\",textRS2,IF(dopRodinnyStav3_2<>\"\",textRS3,IF(dopRodinnyStav4_2<>\"\",textRS4,IF(dopRodinnyStav5_2<>\"\",textRS5,\"\")))))","v":""},"Doplnění",null,null,null,null,null,null,null,null,null,null,null,"dopBytovePomery1",{"$f":"dopBytovePomery1","v":0},{"$f":"FALSE","v":false},false,{"$f":"OR(T48:T52)","v":false}]
[null,null,"kc_Z2_ZpusBydl",{"$f":"IF(dopBytovePomery1_2<>\"\",textBP1,IF(dopBytovePomery2_2<>\"\",textBP2,IF(dopBytovePomery3_2<>\"\",textBP3,IF(dopBytovePomery4_2<>\"\",textBP4,IF(dopBytovePomery5_2<>\"\",textBP5,\"\")))))","v":""},"Doplnění",null,null,null,null,null,null,null,null,null,null,null,"dopBytovePomery4",{"$f":"dopBytovePomery4","v":0},{"$f":"FALSE","v":false},false]
[null,null,"kc_Z2_Vzdelani",{"$f":"IF(dopVzdelani1_2<>\"\",textVzd1,IF(dopVzdelani¨2_2<>\"\",textVzd2,IF(dopVzdelani4_2<>\"\",textVzd3,IF(dopVzdelani6_2<>\"\",textVzd4,IF(dopVzdelani5_2<>\"\",textVzd5,IF(dopVzdelani7_2<>\"\",textVzd6,\"\"))))))","v":""},"Doplnění",null,null,null,null,null,null,null,null,null,null,null,"dopBytovePomery2",{"$f":"dopBytovePomery2","v":0},{"$f":"FALSE","v":false},false]
[null,null,"kc_Z2_PocetDosp",{"$f":"dopDosp2","v":0},"Doplnění",null,null,null,null,null,null,null,null,null,null,null,"dopBytovePomery3",{"$f":"dopBytovePomery3","v":0},{"$f":"FALSE","v":false},false]
[null,null,"kc_Z2_PocetDeti",{"$f":"dopDeti2","v":0},"Doplnění",null,null,null,null,null,null,null,null,null,null,null,"dopBytovePomery5",{"$f":"dopBytovePomery5","v":0},{"$f":"IF(U48=TRUE,FALSE,TRUE)","v":true},false]
[null,null,"kc_Z2_PocetMZam",{"$f":"dopSoucZam2","v":0},"Doplnění",null,null,null,null,null,null,null,null,null,null,null,"dopDelkaPobytu",{"$f":"dopDelkaPobytu","v":0},{"$f":"IF(R53=0,TRUE,FALSE)","v":true}]
[null,null,"kc_Z3_Jmeno",{"$f":"dopJmeno3&\" \"&dopPrijmeni3","v":" "},"Doplnění",null,null,null,null,null,null,null,null,null,null,null,"dopKorespondAdresa1",{"$f":"dopKorespondAdresa1","v":0},{"$f":"FALSE","v":false},false,{"$f":"OR(T54:T55)","v":false}]
[null,null,"kc_Z3_RC",{"$f":"dopRC3","v":""},"Doplnění",null,null,null,null,null,null,null,null,null,null,null,"dopKorespondAdresa2",{"$f":"dopKorespondAdresa2","v":0},{"$f":"IF(U54=TRUE,FALSE,TRUE)","v":true},false]
[null,null,"kc_Z3_Telefon",{"$f":"zadTelefon3","v":0},"Doplnění",null,null,null,null,null,null,null,null,null,null,null,"dopZamestnavatel",{"$f":"dopZamestnavatel","v":0},{"$f":"IF(R56=0,TRUE,FALSE)","v":true}]
[null,null,"kc_Z3_CBskore",null,null,null,null,null,null,null,null,null,null,null,null,null,"dopIC",{"$f":"dopIC","v":0},{"$f":"IF(R57=0,TRUE,FALSE)","v":true}]
[null,null,"kc_Z3_SJM",{"$f":"IF(dopRodinnyStav22_3<>\"\",textSJM1,IF(dopRodinnyStav23_3<>\"\",textSJM2,\"\"))","v":""},"Doplnění",null,null,null,null,null,null,null,null,null,null,null,"dopPracPoz",{"$f":"dopPracPoz","v":0},{"$f":"IF(R58=0,TRUE,FALSE)","v":true}]
[null,null,"kc_Z3_ICzam",{"$f":"dopIC3","v":0},"Doplnění",null,null,null,null,null,null,null,null,null,null,null,"dopZdrojPrijmu1",{"$f":"dopZdrojPrijmu1","v":0},{"$f":"FALSE","v":false},false,{"$f":"OR(T59:T64)","v":false}]
[null,null,"kc_Z3_RodStav",{"$f":"IF(dopRodinnyStav1_3<>\"\",textRS1,IF(dopRodinnyStav2_3<>\"\",textRS2,IF(dopRodinnyStav3_3<>\"\",textRS3,IF(dopRodinnyStav4_3<>\"\",textRS4,IF(dopRodinnyStav5_3<>\"\",textRS5,\"\")))))","v":""},"Doplnění",null,null,null,null,null,null,null,null,null,null,null,"dopZdrojPrijmu2",{"$f":"dopZdrojPrijmu2","v":0},{"$f":"FALSE","v":false},false]
[null,null,"kc_Z3_ZpusBydl",{"$f":"IF(dopBytovePomery1_3<>\"\",textBP1,IF(dopBytovePomery2_3<>\"\",textBP2,IF(dopBytovePomery3_3<>\"\",textBP3,IF(dopBytovePomery4_3<>\"\",textBP4,IF(dopBytovePomery5_3<>\"\",textBP5,\"\")))))","v":""},"Doplnění",null,null,null,null,null,null,null,null,null,null,null,"dopZdrojPrijmu3",{"$f":"dopZdrojPrijmu3","v":0},{"$f":"FALSE","v":false},false]
[null,null,"kc_Z3_Vzdelani",{"$f":"IF(dopVzdelani1_3<>\"\",textVzd1,IF(dopVzdelani¨2_3<>\"\",textVzd2,IF(dopVzdelani4_3<>\"\",textVzd3,IF(dopVzdelani5_3<>\"\",textVzd4,IF(dopVzdelani6_3<>\"\",textVzd5,IF(dopVzdelani7_3<>\"\",textVzd6,\"\"))))))","v":""},"Doplnění",null,null,null,null,null,null,null,null,null,null,null,"dopZdrojPrijmu4",{"$f":"dopZdrojPrijmu4","v":0},{"$f":"FALSE","v":false},false]
[null,null,"kc_Z3_PocetDosp",{"$f":"dopDosp3","v":0},"Doplnění",null,null,null,null,null,null,null,null,null,null,null,"dopZdrojPrijmu5",{"$f":"dopZdrojPrijmu5","v":0},{"$f":"FALSE","v":false},false]
[null,null,"kc_Z3_PocetDeti",{"$f":"dopDeti3","v":0},"Doplnění",null,null,null,null,null,null,null,null,null,null,null,"dopZdrojPrijmu6",{"$f":"dopZdrojPrijmu6","v":0},{"$f":"IF(U59=TRUE,FALSE,TRUE)","v":true},false]
[null,null,"kc_Z3_PocetMZam",{"$f":"dopSoucZam3","v":0},"Doplnění",null,null,null,null,null,null,null,null,null,null,null,"dopZdrojPrijmu12",{"$f":"dopZdrojPrijmu12","v":0},{"$f":"FALSE","v":false},false,{"$f":"OR(T65:T66)","v":false}]
[null,null,"kc_Z4_Jmeno",{"$f":"dopJmeno4&\" \"&dopPrijmeni4","v":" "},"Doplnění",null,null,null,null,null,null,null,null,null,null,null,"dopZdrojPrijmu13",{"$f":"dopZdrojPrijmu13","v":0},{"$f":"IF(R59=\"X\",IF(U65=TRUE,FALSE,TRUE),FALSE)","v":false},false]
[null,null,"kc_Z4_RC",{"$f":"dopRC4","v":""},"Doplnění",null,null,null,null,null,null,null,null,null,null,null,"zavislaCinnost",{"$f":"zavislaCinnost","v":""},{"$f":"IF(R59=\"X\",IF(R67=0,TRUE,FALSE),FALSE)","v":false}]
[null,null,"kc_Z4_Telefon",{"$f":"zadTelefon4","v":0},"Doplnění",null,null,null,null,null,null,null,null,null,null,null,"dopSoucZam",{"$f":"dopSoucZam","v":0},{"$f":"IF(R59=\"X\",IF(R68=0,TRUE,FALSE),FALSE)","v":false}]
[null,null,"kc_Z4_CBskore",null,null,null,null,null,null,null,null,null,null,null,null,null,"dopPredchZam",{"$f":"dopPredchZam","v":0},{"$f":"FALSE","v":false}]
[null,null,"kc_Z4_SJM",{"$f":"IF(dopRodinnyStav21_4<>\"\",textSJM1,IF(dopRodinnyStav23_4<>\"\",textSJM2,\"\"))","v":""},"Doplnění",null,null,null,null,null,null,null,null,null,null,null,"dopZdrojPrijmu14",{"$f":"dopZdrojPrijmu14","v":0},{"$f":"FALSE","v":false},false,{"$f":"OR(T70:T71)","v":false}]
[null,null,"kc_Z4_ICzam",{"$f":"dopIC4","v":0},"Doplnění",null,null,null,null,null,null,null,null,null,null,null,"dopZdrojPrijmu15",{"$f":"dopZdrojPrijmu15","v":0},{"$f":"IF(R59=\"X\",IF(U70=TRUE,FALSE,TRUE),FALSE)","v":false},false]
[null,null,"kc_Z4_RodStav",{"$f":"IF(dopRodinnyStav1_4<>\"\",textRS1,IF(dopRodinnyStav22_4<>\"\",textRS2,IF(dopRodinnyStav3_4<>\"\",textRS3,IF(dopRodinnyStav4_4<>\"\",textRS4,IF(dopRodinnyStav5_4<>\"\",textRS5,\"\")))))","v":""},"Doplnění",null,null,null,null,null,null,null,null,null,null,null,"samostatneVydelecnaCinnost",{"$f":"samostatneVydelecnaCinnost","v":0},{"$f":"IF(R60=\"X\",IF(R72=0,TRUE,FALSE),FALSE)","v":false}]
[null,null,"kc_Z4_ZpusBydl",{"$f":"IF(dopBytovePomery1_4<>\"\",textBP1,IF(dopBytovePomery2_4<>\"\",textBP2,IF(dopZvlastniVztah3_4<>\"\",textBP3,IF(dopZvlastniVztah4_4<>\"\",textBP4,IF(dopZvlastniVztah5_4<>\"\",textBP5,\"\")))))","v":""},"Doplnění",null,null,null,null,null,null,null,null,null,null,null,"dopZdrojPrijmu21",{"$f":"dopZdrojPrijmu21","v":0},{"$f":"FALSE","v":false},false,{"$f":"OR(T73:T74)","v":false}]
[null,null,"kc_Z4_Vzdelani",{"$f":"IF(dopVzdelani1_4<>\"\",textVzd1,IF(dopVzdelani¨2_4<>\"\",textVzd2,IF(dopVzdelani4_4<>\"\",textVzd3,IF(dopVzdelani5_4<>\"\",textVzd4,IF(dopVzdelani6_4<>\"\",textVzd5,IF(dopVzdelani7_4<>\"\",textVzd6,\"\"))))))","v":""},"Doplnění",null,null,null,null,null,null,null,null,null,null,null,"dopZdrojPrijmu22",{"$f":"dopZdrojPrijmu22","v":0},{"$f":"IF(R60=\"X\",IF(U73=TRUE,FALSE,TRUE),FALSE)","v":false},false]
[null,null,"kc_Z4_PocetDosp",{"$f":"dopDosp4","v":0},"Doplnění",null,null,null,null,null,null,null,null,null,null,null,"prijemZPronajmu",{"$f":"prijemZPronajmu","v":0},{"$f":"IF(R61=\"X\",IF(R75=0,TRUE,FALSE),FALSE)","v":false}]
[null,null,"kc_Z4_PocetDeti",{"$f":"dopDeti4","v":0},"Doplnění",null,null,null,null,null,null,null,null,null,null,null,"prijemZKapitalovehoMajetku",{"$f":"prijemZKapitalovehoMajetku","v":0},{"$f":"IF(R62=\"X\",IF(R76=0,TRUE,FALSE),FALSE)","v":false}]
[null,null,"kc_Z4_PocetMZam",{"$f":"dopSoucZam4","v":0},"Doplnění",null,null,null,null,null,null,null,null,null,null,null,"starobniDuchod",{"$f":"starobniDuchod","v":0},{"$f":"IF(R63=\"X\",IF(R77=0,TRUE,FALSE),FALSE)","v":false}]
[null,null,"nemovitost",null,null,null,null,null,null,null,null,null,null,null,null,null,"jiny",{"$f":"jiny","v":0},{"$f":"IF(R64=\"X\",IF(R78=0,TRUE,FALSE),FALSE)","v":false}]
[null,null,"nemPocetNemov",{"$f":"nem_PocetNem","v":1},"Nemovitost",null,null,null,null,null,null,null,null,null,null,null,"dopDosp",{"$f":"dopDosp","v":1},{"$f":"IF(R79=0,TRUE,FALSE)","v":false}]
[null,null,"cbUP_TypKlient",{"$f":"nem_TypKlienta","v":0},"Splátka",null,null,null,null,null,null,null,null,null,null,null,"dopDeti",{"$f":"dopDeti","v":0},{"$f":"FALSE","v":false}]
[null,null,"nem_UverZamDuchBanky",false,"Nemovitost",null,null,null,null,null,null,null,null,null,null,null,"dopTypUrS1",{"$f":"dopTypUrS1","v":"X"},{"$f":"FALSE","v":false},true,{"$f":"OR(T81:T82)","v":true}]
[null,null,"Devel_pr",{"$f":"DP","v":false},"Nemovitost",null,null,null,null,null,null,null,null,null,null,null,"dopTypUrS2",{"$f":"dopTypUrS2","v":""},{"$f":"IF(U81=TRUE,FALSE,TRUE)","v":false},true]
[null,null,"nem_DPFinancBanka",{"$f":"nem_DPFinBank","v":0},"Nemovitost",null,null,null,null,null,null,null,null,null,null,null,"dopUcelUveru1",{"$f":"dopUcelUveru1","v":""},{"$f":"FALSE","v":false},true,{"$f":"OR(T83:T88)","v":true}]
[null,null,"nem_TypDP",{"$f":"nem_TypDP","v":0},"Nemovitost",null,null,null,null,null,null,null,null,null,null,null,"dopUcelUveru2",{"$f":"dopUcelUveru2","v":""},{"$f":"FALSE","v":false},true]
[null,null,"nem_NazevDP",{"$f":"IF(nem_NazevDP=\"\",DP_JinyNazev,nem_NazevDP)","v":0},"Nemovitost",null,null,null,null,null,null,null,null,null,null,null,"dopUcelUveru3",{"$f":"dopUcelUveru3","v":""},{"$f":"FALSE","v":false},true]
[null,null,"kcTHnemovitosti1",{"$f":"trzniHodnotaNemovistosti","v":0},"Nemovitost",null,null,null,null,null,null,null,null,null,null,null,"dopUcelUveru4",{"$f":"dopUcelUveru4","v":""},{"$f":"FALSE","v":false},true]
[null,null,"nem1_THNemNaZaklade",{"$f":"nemTrzniHodnota","v":"vyberte"},"Nemovitost",null,null,null,null,null,null,null,null,null,null,null,"dopUcelUveru5",{"$f":"dopUcelUveru5","v":""},{"$f":"FALSE","v":false},true]
[null,null,"nem_TypNemovitosti",{"$f":"SplTypNemovitosti","v":"zděná nemovitost nebo pozemek"},"Nemovitost",null,null,null,null,null,null,null,null,null,null,null,"dopUcelUveru6",{"$f":"dopUcelUveru6","v":0},{"$f":"IF(U83=TRUE,FALSE,TRUE)","v":false},false]
[null,null,"Nem1_DatumOcenění",{"$f":"nemDatumOceneni","v":0},"Nemovitost",null,null,null,null,null,null,null,null,null,null,null,"dopTypUveru1",{"$f":"dopTypUveru1","v":"X"},{"$f":"FALSE","v":false}]
[null,null,"RozdTypNem1",null,"Nemovitost",null,null,null,null,null,null,null,null,null,null,null,"dopTypUveru2",{"$f":"dopTypUveru2","v":""},{"$f":"FALSE","v":false}]
[null,null,"kcMaxLTV1",{"$f":"LTV","v":""},"Nemovitost",null,null,null,null,null,null,null,null,null,null,null,"dopTypUveru3",{"$f":"dopTypUveru3","v":""},{"$f":"FALSE","v":false}]
[null,null,"nem_MinStavNaklady1",{"$f":"minimalniStavebniNaklady1","v":0},"Nemovitost",null,null,null,null,null,null,null,null,null,null,null,"dopTypUveru4",{"$f":"dopTypUveru4","v":""},{"$f":"FALSE","v":false}]
[null,null,"nem_StavNaklady1",{"$f":"stavebniNaklady","v":0},"Nemovitost",null,null,null,null,null,null,null,null,null,null,null,"dopTypUveru5",{"$f":"dopTypUveru5","v":""},{"$f":"FALSE","v":false}]
[null,null,"nem_HodnZavazku1",{"$f":"hodnotaZavazku","v":0},"Nemovitost",null,null,null,null,null,null,null,null,null,null,null,"dopAdrNem",{"$f":"dopAdrNem","v":0},{"$f":"IF(R94=0,TRUE,FALSE)","v":true}]
[null,null,"nem_FinancNem",{"$f":"nemFinancovanaNemovitost","v":"je v zástavě"},"Nemovitost",null,null,null,null,null,null,null,null,null,null,null,"dopCLV",{"$f":"dopCLV","v":0},{"$f":"IF(R95=0,TRUE,FALSE)","v":true}]
[null,null,"kcTHnemovitosti2",{"$f":"trzniHodnotaNemovistosti2","v":0},"Nemovitost",null,null,null,null,null,null,null,null,null,null,null,"dopVyseInvestice",{"$f":"dopVyseInvestice","v":0},{"$f":"IF(R96=0,TRUE,FALSE)","v":true}]
[null,null,"nem2_THNemNaZaklade",{"$f":"nemTrzniHodnota2","v":"vyberte"},"Nemovitost",null,null,null,null,null,null,null,null,null,null,null,"dopUcelVyuzitiObjektu1",{"$f":"dopUcelVyuzitiObjektu1","v":0},{"$f":"FALSE","v":false},false,{"$f":"OR(T97:T99)","v":false}]
[null,null,"nem_TypNemovitosti2",{"$f":"nemTypNemovitosti2","v":"vyberte"},"Nemovitost",null,null,null,null,null,null,null,null,null,null,null,"dopUcelVyuzitiObjektu2",{"$f":"dopUcelVyuzitiObjektu2","v":0},{"$f":"FALSE","v":false},false]
[null,null,"Nem2_DatumOcenění",{"$f":"nemDatumOceneni2","v":"00:00:00"},"Nemovitost",null,null,null,null,null,null,null,null,null,null,null,"dopUcelVyuzitiObjektu3",{"$f":"dopUcelVyuzitiObjektu3","v":0},{"$f":"IF(U97=TRUE,FALSE,TRUE)","v":true},false]
[null,null,"RozdTypNem2",{"$f":"SplTypNemovitosti","v":"zděná nemovitost nebo pozemek"},"Nemovitost",null,null,null,null,null,null,null,null,null,null,null,"dopZastavenaNemovitost1",{"$f":"dopZastavenaNemovitost1","v":0},{"$f":"FALSE","v":false},{"$f":"IF(R100=0,FALSE,TRUE)","v":false},{"$f":"OR(T100:T101)","v":false}]
[null,null,"nem_MinStavNaklady2",{"$f":"minimalniStavebniNaklady2","v":0},"Nemovitost",null,null,null,null,null,null,null,null,null,null,null,"dopZastavenaNemovitost2",{"$f":"dopZastavenaNemovitost2","v":0},{"$f":"IF(U100=TRUE,FALSE,TRUE)","v":true},{"$f":"IF(R101=0,FALSE,TRUE)","v":false}]
[null,null,"kcMaxLTV2",{"$f":"LTV","v":""},"Nemovitost",null,null,null,null,null,null,null,null,null,null,null,"dopVlastnikNemovitosti1",{"$f":"dopVlastnikNemovitosti1","v":0},{"$f":"FALSE","v":false},{"$f":"IF(R102=0,FALSE,TRUE)","v":false},{"$f":"OR(T102:T104)","v":false}]
[null,null,"nem_StavNaklady2",{"$f":"stavebniNaklady2","v":0},"Nemovitost",null,null,null,null,null,null,null,null,null,null,null,"dopVlastnikNemovitosti2",{"$f":"dopVlastnikNemovitosti2","v":0},{"$f":"FALSE","v":false},{"$f":"IF(R103=0,FALSE,TRUE)","v":false}]
[null,null,"nem_HodnZavazku2",{"$f":"hodnotaZavazku2","v":0},"Nemovitost",null,null,null,null,null,null,null,null,null,null,null,"dopVlastnikNemovitosti3",{"$f":"dopVlastnikNemovitosti3","v":0},{"$f":"IF(R100=\"X\",FALSE,IF(U102=TRUE,FALSE,TRUE))","v":true},{"$f":"IF(R104=0,FALSE,TRUE)","v":false}]
[null,null,"kcTHnemovitosti3",{"$f":"trzniHodnotaNemovistosti3","v":0},"Nemovitost",null,null,null,null,null,null,null,null,null,null,null,"dopAdresaNemovitosti",{"$f":"dopAdresaNemovitosti","v":0},{"$f":"IF(R100=\"X\",FALSE,IF(R105=0,TRUE,FALSE))","v":true}]
[null,null,"nem3_THNemNaZaklade",{"$f":"nemTrzniHodnota3","v":"vyberte"},"Nemovitost",null,null,null,null,null,null,null,null,null,null,null,"Dopl_Fixni",{"$f":"Dopl_Fixni","v":"3 "},{"$f":"IF(R106=0,TRUE,FALSE)","v":false}]
[null,null,"nem_TypNemovitosti3",{"$f":"nemTypNemovitosti3","v":"vyberte"},"Nemovitost",null,null,null,null,null,null,null,null,null,null,null,"Dopl_DelkaCerpani",{"$f":"Dopl_DelkaCerpani","v":0},{"$f":"IF(R107=0,TRUE,FALSE)","v":true}]
[null,null,"Nem3_DatumOcenění",{"$f":"nemDatumOceneni3","v":"00:00:00"},"Nemovitost",null,null,null,null,null,null,null,null,null,null,null,"dopUcelUveru6_Jiny",{"$f":"dopUcelUveru6_Jiny","v":""},{"$f":"IF(R88<>0,IF(R108=0,TRUE,FALSE),FALSE)","v":false}]
[null,null,"RozdTypNem3",null,"Nemovitost",null,null,null,null,null,null,null,null,null,null,null,"Dopl_UcelVyuziti1",{"$f":"Dopl_UcelVyuziti1","v":0},{"$f":"FALSE","v":false},{"$f":"IF(R109=0,FALSE,TRUE)","v":false},{"$f":"OR(T109:T111)","v":false}]
[null,null,"kcMaxLTV3",{"$f":"LTV","v":""},"Nemovitost",null,null,null,null,null,null,null,null,null,null,null,"Dopl_UcelVyuziti2",{"$f":"Dopl_UcelVyuziti2","v":0},{"$f":"FALSE","v":false},{"$f":"IF(R110=0,FALSE,TRUE)","v":false}]
[null,null,"nem_MinStavNaklady3",{"$f":"minimalniStavebniNaklady3","v":0},"Nemovitost",null,null,null,null,null,null,null,null,null,null,null,"Dopl_UcelVyuziti3",{"$f":"Dopl_UcelVyuziti3","v":0},{"$f":"IF(R100=\"X\",FALSE,IF(U109=TRUE,FALSE,TRUE))","v":true},{"$f":"IF(R111=0,FALSE,TRUE)","v":false}]
[null,null,"nem_StavNaklady3",{"$f":"stavebniNaklady3","v":0},"Nemovitost",null,null,null,null,null,null,null,null,null,null,null,"dopMisto",{"$f":"dopMisto","v":0},{"$f":"IF(R112=0,TRUE,FALSE)","v":true}]
[null,null,"nem_HodnZavazku3",{"$f":"hodnotaZavazku3","v":0},"Nemovitost",null,null,null,null,null,null,null,null,null,null,null,"Dopl_Datum1",{"$f":"Dopl_Datum1","v":0},{"$f":"IF(R113=0,TRUE,FALSE)","v":true}]
[null,null,"kontrolni list",null,null,null,null,null,null,null,null,null,null,null,null,null,"zJpA",{"$f":"zJpA","v":0},{"$f":"FALSE","v":false},{"$f":"IF(R114=0,FALSE,TRUE)","v":false},{"$f":"OR(T114:T117)","v":false}]
[null,null,"kl_PoplPoskyt",{"$f":"IF(Splatka!E60=\"\",splPoplPosk,Splatka!E60)","v":2500},"Splátka","tam je sleva na poplatcích, ale kde je výše poplatku? není to daný pevně a tohle se dopočítá samo po slevě?",null,null,null,null,null,null,null,null,null,null,"zJpB",{"$f":"zJpB","v":0},{"$f":"FALSE","v":false},false]
[null,null,"kl_PoplNnV",{"$f":"IF(splPoplNnVx=\"\",splPoplNnV,splPoplNnVx)","v":1500},"Splátka",null,null,null,null,null,null,null,null,null,null,null,"zJpC",{"$f":"zJpC","v":0},{"$f":"FALSE","v":false},false]
[null,null,"kl_PoplVedeniUveru",0,"Splátka",null,null,null,null,null,null,null,null,null,null,null,"zMes",{"$f":"zMes","v":0},{"$f":"FALSE","v":false},false]
[null,null,"kl_PoplCelkem",null,null,null,null,null,null,null,null,null,null,null,null,null,"zPojistenyHlavni",{"$f":"zPojistenyHlavni","v":0},{"$f":"FALSE","v":false},false,{"$f":"OR(T118:T119)","v":false}]
[null,null,"kcOptionSpread",{"$f":"SplOs","v":2.0000000000000001E-4},null,null,null,null,null,null,null,null,null,null,null,null,"zPojistenySpolu",{"$f":"zPojistenySpolu","v":0},{"$f":"FALSE","v":false},false]
[null,null,"bTypSlevy2",null,null,null,null,null,null,null,null,null,null,null,null,null,"dopZajOSlevu3",{"$f":"dopZajOSlevu3","v":"X"},{"$f":"IF(R120=0,TRUE,FALSE)","v":false}]
[null,null,"bTypSlevy3",null,null,null,null,null,null,null,null,null,null,null,null,null,{"$f":"OR(S28:S120)","v":true}]
[null,null,"bVyseSlevy2",{"$f":"J16","v":""}]
[null,null,"bVyseSlevy3",{"$f":"K16","v":""}]
[]
[null,null,"bPocetZadatelu",{"$f":"ZadPocetZadatelu","v":1}]
[null,null,"Kontroly WF",null,null,null,null,null,null,null,null,null,null,null,null,null,"Zadost"]
[null,null,"Kontrola APS",null,null,null,null,null,null,null,null,null,null,null,null,null,"zPracovnikBanky",{"$f":"zPracovnikBanky","v":0},{"$f":"IF(R127=0,TRUE,FALSE)","v":true}]
[null,null,"Kontrola Nem",null,null,null,null,null,null,null,null,null,null,null,null,null,"zPobocka",{"$f":"zPobocka","v":0},{"$f":"IF(R128=0,TRUE,FALSE)","v":true}]
[null,null,"Kontrola",null,null,null,null,null,null,null,null,null,null,null,null,null,"zNdg",{"$f":"zNdg","v":0},true]
[null,null,"Datumy","2016.02.02 14:41:29",null,null,null,null,null,null,null,null,null,null,null,null,"zCisloZadosti",{"$f":"zCisloZadosti","v":0},true]
[null,null,"DatumVytvořeníSplátka",null,null,null,null,null,null,null,null,null,null,null,null,null,"zadJmeno",{"$f":"zadJmeno","v":""},false]
[null,null,"kcOptionSpread",{"$f":"IF(VypocitatPodle=0,SplOs,IF(VypocitatPodle=1,SplOsZmena,IF(VypocitatPodle=2,SplOsZmena2,SplOs)))","v":2.0000000000000001E-4},null,null,null,null,null,null,null,null,null,null,null,null,"zadDatNar",{"$f":"zadDatNar","v":""},false]
[null,null,"kcMarketRate",{"$f":"IF(VypocitatPodle=0,SplCs,IF(VypocitatPodle=1,SplCsZmena,IF(VypocitatPodle=2,SplCsZmena2,SplCs)))","v":3.8999999999999994E-3},null,null,null,null,null,null,null,null,null,null,null,null,"zadPrijmeni",{"$f":"SplPrijmeniKlienta","v":0},true]
[null,null,"kcCountrySpread",{"$f":"SplCoSpZmena2","v":0},null,null,null,null,null,null,null,null,null,null,null,null,"zadZemeNar",{"$f":"zadZemeNar","v":0},{"$f":"FALSE","v":false}]
[null,null,"kcSpecialRefinancSpread",{"$f":"IF(VypocitatPodle=0,SplSrs,IF(VypocitatPodle=1,SplSrsZmena,IF(VypocitatPodle=2,SplSrsZmena2,SplSrs)))","v":1E-4},null,null,null,null,null,null,null,null,null,null,null,null,"zadRC",{"$f":"zadRC","v":0},true]
[null,null,"kcRizikMarze",{"$f":"IF(VypocitatPodle=0,SplRm,IF(VypocitatPodle=1,SplRmOmZmena/2,IF(VypocitatPodle=2,SplRmZmena2,SplCs)))","v":8.4000000000000012E-3},null,null,null,null,null,null,null,null,null,null,null,null,"zadPohlavi1",{"$f":"zadPohlavi1","v":""},{"$f":"FALSE","v":false},{"$f":"IF(R136=0,FALSE,TRUE)","v":true},{"$f":"OR(T136:T137)","v":true}]
[null,null,"kcObchodMarze",{"$f":"IF(VypocitatPodle=0,SplOm,IF(VypocitatPodle=1,SplRmOmZmena/2,IF(VypocitatPodle=2,SplOmZmena2,SplCs)))","v":5.1799999999999999E-2},null,null,null,null,null,null,null,null,null,null,null,null,"zadPohlavi2",{"$f":"zadPohlavi2","v":""},{"$f":"IF(U136=TRUE,FALSE,TRUE)","v":false},{"$f":"IF(R137=0,FALSE,TRUE)","v":true}]
[null,null,"DalsiUcelUveru",{"$f":"nemDalsiUcel","v":"Rekonstrukce"},null,null,null,null,null,null,null,null,null,null,null,null,"zadAdr",{"$f":"zadAdr","v":0},{"$f":"IF(R138=0,TRUE,FALSE)","v":true}]
[null,null,"DevelopProjekt",{"$f":"DP","v":false},null,null,null,null,null,null,null,null,null,null,null,null,"zadTypDokladu1",{"$f":"zadTypDokladu1","v":0},{"$f":"FALSE","v":false},{"$f":"IF(R139=0,FALSE,TRUE)","v":false},{"$f":"OR(T139:T141)","v":false}]
[null,null,"adminCelkovePrijmySpol",{"$f":"adminPrijmySpoluzadatel","v":0},null,null,null,null,null,null,null,null,null,null,null,null,"zadTypDokladu2",{"$f":"zadTypDokladu2","v":0},{"$f":"FALSE","v":false},{"$f":"IF(R140=0,FALSE,TRUE)","v":false}]
[null,null,"SplatnostPrepocetMesice",{"$f":"SplatnostPrepocetMesice","v":0},null,null,null,null,null,null,null,null,null,null,null,null,"zadTypDokladu3",{"$f":"zadTypDokladu3","v":0},{"$f":"IF(U139=TRUE,FALSE,TRUE)","v":true},{"$f":"IF(R141=0,FALSE,TRUE)","v":false}]
[null,null,"nemTHpoDokonceni",{"$f":"nemTrzniHodnotaPoDokonceni","v":0},null,null,null,null,null,null,null,null,null,null,null,null,"zadCisloDokladu",{"$f":"zadCisloDokladu","v":0},{"$f":"IF(R142=0,TRUE,FALSE)","v":true}]
[null,null,"nemStavebNaklady",{"$f":"nemStavebniNaklady","v":0},null,null,null,null,null,null,null,null,null,null,null,null,"zadZemeVydaniDokladu",{"$f":"zadZemeVydaniDokladu","v":0},{"$f":"FALSE","v":false}]
[null,null,"nemUverNaVystavbu",{"$f":"nemUverNaVystavbu","v":0},null,null,null,null,null,null,null,null,null,null,null,null,"zadDatumVydaniDokladu",{"$f":"zadDatumVydaniDokladu","v":0},{"$f":"IF(R144=0,TRUE,FALSE)","v":true}]
[null,null,"NemVlastniZdroje",{"$f":"vlastniZdroje","v":0},null,null,null,null,null,null,null,null,null,null,null,null,"zadTelefon",{"$f":"zadTelefon","v":0},true]
[null,null,"nemProcentoRozestOdhad",{"$f":"nemRozestavenostiZOdhadu","v":0},null,null,null,null,null,null,null,null,null,null,null,null,"zadEmail",{"$f":"zadEmail","v":0},true]
[null,null,"nemVlastniZdroje1",{"$f":"nemVlastniZdroje","v":0},null,null,null,null,null,null,null,null,null,null,null,null,"celkVyseUveru",{"$f":"celkVyseUveru","v":2060000},false]
[null,null,"nemTranse1",{"$f":"nem1Transe","v":0},null,null,null,null,null,null,null,null,null,null,null,null,"VyseUcelCast",{"$f":"VyseUcelCast","v":""},{"$f":"FALSE","v":false}]
[null,null,"nemVlastniZdroje2",{"$f":"nemVlastniZdroje2","v":0},null,null,null,null,null,null,null,null,null,null,null,null,"PocetSplatekzad",{"$f":"PocetSplatekzad","v":300},false]
[null,null,"nemTranse2",{"$f":"nem2Transe","v":0},null,null,null,null,null,null,null,null,null,null,null,null,"vyseNeuceloveCasti",{"$f":"vyseNeuceloveCasti","v":""},{"$f":"FALSE","v":false}]
[null,null,"nemVlastniZdroje3",{"$f":"nemVlastniZdroje3","v":0},null,null,null,null,null,null,null,null,null,null,null,null,"zadUcelUveru1",{"$f":"zadUcelUveru1","v":""},{"$f":"FALSE","v":false},{"$f":"IF(R151=0,FALSE,TRUE)","v":true},{"$f":"OR(T151:T152)","v":true}]
[null,null,"nemTranse3",{"$f":"nem3Transe","v":0},null,null,null,null,null,null,null,null,null,null,null,null,"zadUcelUveru2",{"$f":"zadUcelUveru2","v":"X"},{"$f":"IF(U151=TRUE,FALSE,TRUE)","v":false},{"$f":"IF(R152=0,FALSE,TRUE)","v":true}]
[null,null,"nemLTVTH",{"$f":"nemLTV","v":0},null,null,null,null,null,null,null,null,null,null,null,null,"zadUverVKomb1",{"$f":"zadUverVKomb1","v":""},{"$f":"FALSE","v":false},{"$f":"IF(R153=0,FALSE,TRUE)","v":true},{"$f":"OR(T153:T154)","v":true}]
[null,null,"VyseUverTwin",{"$f":"vyseUveru2","v":0},null,null,null,null,null,null,null,null,null,null,null,null,"zadUverVKomb2",{"$f":"zadUverVKomb2","v":"X"},{"$f":"IF(U153=TRUE,FALSE,TRUE)","v":false},{"$f":"IF(R154=0,FALSE,TRUE)","v":true}]
[null,null,"VyseSplatky",{"$f":"Splatka","v":0},null,null,null,null,null,null,null,null,null,null,null,null,"zadMisto",{"$f":"zadMisto","v":0},{"$f":"IF(R155=0,TRUE,FALSE)","v":true}]
[null,null,"PoplPosk",{"$f":"splPoplPosk-splPoplPoskZmena","v":2500},null,null,null,null,null,null,null,null,null,null,null,null,"zadDatum",{"$f":"zadDatum","v":0},{"$f":"IF(R156=0,TRUE,FALSE)","v":true}]
[null,null,"urokova_sazba",{"$f":"UrSazba","v":0},null,null,null,null,null,null,null,null,null,null,null,null,{"$f":"OR(S127:S156)","v":true}]
[null,null,"predschval_sleva",{"$f":"SlevaNaTvrdo","v":0}]
[null,null,"Jednorázové pojištění",{"$f":"SlevaCardif","v":"Ano"},null,null,null,null,null,null,null,null,null,null,null,null,"Bonita"]
[null,null,"Měsíční pojištění",{"$f":"zMes","v":0},null,null,null,null,null,null,null,null,null,null,null,null,"bonDostatecna",{"$f":"bonDostatecna","v":""},{"$f":"IF(R160=\"\",TRUE,FALSE)","v":true}]
[null,null,"Měna",{"$f":"SplMenaZmena2","v":"CZK"}]
[null,null,"opbuZastoupeniAno/Ne",0,null,null,null,null,null,null,null,null,null,null,null,null,"Splatka"]
[null,null,"Výše pojištění ",{"$f":"VysePojisteni","v":60000},null,null,null,null,null,null,null,null,null,null,null,null,"SplatkaTrigger",{"$f":"SplatkaTrigger","v":0},{"$f":"IF(R163=0,TRUE,FALSE)","v":true}]
[null,null,"VlastnikZastNem",{"$f":"VlastnikZastNem","v":0}]
[null,null,"identifikaceZajištění",{"$f":"IF(dopVlastnikNemovitosti1=\"x\",\"žadatel nebo spolužadatel,\",IF(dopVlastnikNemovitosti2=\"x\",\"osoba blízká,\",IF(dopVlastnikNemovitosti3=\"x\",\"jiná osoba,\",\"\"))&dopAdresaNemovitosti&IF(dopAdresaNemovitosti=\"\",\"\",\",\")&IF(Doplneni!C175=\"x\",\"Byt,\",IF(Doplneni!C177=\"x\",\"Rodinný dům,\",IF(Doplneni!C179=\"x\",\"Stavební pozemek,\",IF(Doplneni!C181=\"x\",\"Rekreační objekt,\",\"\")))&Doplneni!N183&IF(Doplneni!N183=\"\",\"\",\",\")&IF(Dopl_UcelVyuziti1=\"x\",\"vlastní bydlení\",IF(Dopl_UcelVyuziti2=\"x\",\"rekreace\",IF(Dopl_UcelVyuziti3=\"x\",\"pronájem\",\"\")))))","v":""},null,null,null,null,null,null,null,null,null,null,null,null,"když se rovná pravda - msgbox - chybí vyplnit pole"]
[null,null,"ucel1",{"$f":"HlavUcelUveru","v":0},null,null,null,null,null,null,null,null,null,null,null,null,"kontrola se spouští se spuštěním WF"]
[null,null,"ucel2",{"$f":"nemDalsiUcel","v":"Rekonstrukce"}]
[null,null,"ucel3",{"$f":"nemDalsiUcel2","v":"Bez dalšího účelu"}]
[null,null,"ucel4",{"$f":"nemDalsiUcel3","v":"Bez dalšího účelu"}]
[null,null,"Financ=zastav Nem",{"$f":"IF(nemFinancovanaNemovitost=\"je v zástavě\",\"ano\",\"ne\")","v":"ano"}]
[null,null,"JmenoZamDuchBanka",{"$f":"JmenoZamDuchBanka","v":0}]
[null,null,"MarketingSazba",{"$f":"SplMarketingSleva","v":0}]

{"sheet":"DP","index":23,"n_rows":212,"n_cols":6,"rows_kept":212,"cut":false,"hidden":true,"merged":[]}
["Byty","Pozemky","Rodinné domy",null,null,"DP"]
["Astra park Klecany","Herink","Buštěhrad",null,null,{"$f":"IF(nem_TypDP=DP_Byty,DP_Byty_Seznam,IF(nem_TypDP=DP_Pozemky,DP_Pozemky_Seznam,IF(nem_TypDP=DP_RodinneDomy,DP_RodinneDomy,\"X\")))","v":"X"}]
["Beroun - Koněpruská","Jenišov","Býkev",null,null,"X"]
["Beroun - Na Veselé - Krásný svět","Jílové u Prahy - Radlík","Držovice - Prostějov",null,null,"X"]
["Bohdalice - čp. 78","Mníšek pod Brdy - V Lipkách","Herink",null,null,"X"]
["Brandýs nad labem - Vinice sv. Václava - ul. Kralupská","Sibřina - Na Březině - Koloděje","Chýně - při ul. Rudenské",null,null,"X"]
["Brno - Brno-Purkyňova 74","Vysoký Újezd - Zámecké zahrady","Krakovany",null,null,"X"]
["Brno - Bystrc - Kamechy","Zbuzany","Lázně Bohdaneč",null,null,"X"]
["Brno - Cacovická","Zdiměřice","Lidice - Lidická Alej",null,null,"X"]
["Brno - Gajdošova","Zlín - Příluky","Milovice - Tyršova ul",null,null,"X"]
["Brno - Horova",null,"Moravany - Jabloňový sad - ŘRD",null,null,"X"]
["Brno - Kníničky",null,"Nelahozeves - Lešany",null,null,"X"]
["Brno - Kociánka",null,"Nezabylice",null,null,"X"]
["Brno - Kopečná",null,"Nová Ves",null,null,"X"]
["Brno - Královopolská_Zemkova",null,"Opatovice",null,null,"X"]
["Brno - Křenová",null,"Praha - Radotín",null,null,"X"]
["Brno - Křídlovická",null,"Praha - V Šáreckém údolí",null,null,"X"]
["Brno - Lidická",null,"Stehelčeves - Palladium",null,null,"X"]
["Brno - Milady Horákové",null,"Střelice u Brna",null,null,"X"]
["Brno - Minská",null,"Svitavy - Rezidence Park",null,null,"X"]
["Brno - Mojmírovo nám",null,"Teplice- Pudlák",null,null,"X"]
["Brno - Musilova",null,"Trnová u Jíloviště - Trnová Building s.r.o",null,null,"X"]
["Brno - Podvéská",null,"Troubsko",null,null,"X"]
["Brno - Sochorova",null,"Tuřany - Heřmánek",null,null,"X"]
["Brno - třída Generála Píky",null,"Úvaly - Slunečné terasy",null,null,"X"]
["Brno - U Červeného mlýna - Ponava Centrum",null,null,null,null,"X"]
["Brno - Veslařská",null,null,null,null,"X"]
["Brno - Vídeňská - Komfort",null,null,null,null,"X"]
["Brno - Zoubkova",null,null,null,null,"X"]
["Brno - Žabovřesky Kovařovicova",null,null,null,null,"X"]
["Břeclav - Euro BK",null,null,null,null,"X"]
["Dobřichovice - BD - Berounka",null,null,null,null,"X"]
["Doksy - Rezidence Staré Splavy - ",null,null,null,null,"X"]
["Dolní Břežany - Náměstí na Sádkách 705",null,null,null,null,"X"]
["Dvůr Králové nad Labem - Tylova ul. dům B",null,null,null,null,"X"]
["Holubice - Holubí háj etapa E",null,null,null,null,"X"]
["Horoměřice - TGM",null,null,null,null,"X"]
["Hostivice - DP Hostivice  Unhošťská",null,null,null,null,"X"]
["Hradec Králové",null,null,null,null,"X"]
["Jablonec n.N",null,null,null,null,"X"]
["Jesenice - V Roháči",null,null,null,null,"X"]
["Jihlava",null,null,null,null,"X"]
["Josefův Důl",null,null,null,null,"X"]
["Karlovy Vary - Rezidence Moser",null,null,null,null,"X"]
["Karlovy Vary - Rezidence Svahová",null,null,null,null,"X"]
["Kladno - Garden Spot",null,null,null,null,"X"]
["Klecany",null,null,null,null,"X"]
["Kořenec",null,null,null,null,"X"]
["Kroměříž - Kroměříž",null,null,null,null,"X"]
["Kuřim - Brněnská",null,null,null,null,"X"]
["Kuřim - Tyršova-Brněnská",null,null,null,null,"X"]
["Kvilda",null,null,null,null,"X"]
["Lysá nad Labem - DP Zahrady",null,null,null,null,"X"]
["Mariánské Lázně - DP Beskyd",null,null,null,null,"X"]
["Mariánské Lázně - DP Sněžka",null,null,null,null,"X"]
["Mariánské Lázně - Hlavní",null,null,null,null,"X"]
["Mělník - Na Výsluní",null,null,null,null,"X"]
["Milovice",null,null,null,null,"X"]
["Mníšek pod Brdy - Mníšecký Eden",null,null,null,null,"X"]
["Moravany - Jabloňový sad",null,null,null,null,"X"]
["Olomouc - Českobratrská",null,null,null,null,"X"]
["Olomouc - Rokycanova",null,null,null,null,"X"]
["Olomouc - Sladké město",null,null,null,null,"X"]
["Ostrava - Kostelní náměstí",null,null,null,null,"X"]
["Ostrava - Nová Bělá",null,null,null,null,"X"]
["Ostrava - Nová Karolina",null,null,null,null,{"$f":"IF(nem_TypDP=DP_Byty,DP_Byty_Seznam,IF(nem_TypDP=DP_Pozemky,DP_Pozemky_Seznam,IF(nem_TypDP=DP_RodinneDomy,DP_RodinneDomy,\"X\")))","v":"X"}]
["Ostrava - Vítězná",null,null,null,null,"X"]
["Ostrov nad Ohří - Rezidence Severní",null,null,null,null,"X"]
["Pardubice - Nová Cihelna",null,null,null,null,"X"]
["Pardubice - Plachta III",null,null,null,null,"X"]
["Pečky",null,null,null,null,"X"]
["Pelhřimov - U Stínadel",null,null,null,null,"X"]
["Plzeň - BD na Zeleném trojúhelníku",null,null,null,null,"X"]
["Plzeň - Palác Erlich",null,null,null,null,"X"]
["Plzeň - RokycanskáVyhlídková",null,null,null,null,"X"]
["Plzeň - Slunečné terasy",null,null,null,null,"X"]
["Praha - Hájek u Uhříněvsi",null,null,null,null,"X"]
["Praha - Chodovec-City bytový dům C a D",null,null,null,null,"X"]
["Praha 1 - Dlouhá 727-39",null,null,null,null,"X"]
["Praha 2 - DP Budečská 6",null,null,null,null,"X"]
["Praha 3 - Central Park",null,null,null,null,"X"]
["Praha 3 - Husinecká",null,null,null,null,"X"]
["Praha 3 - Jeseniova",null,null,null,null,"X"]
["Praha 3 - Kališnická",null,null,null,null,"X"]
["Praha 3 - Koněvova, BD Maršál",null,null,null,null,"X"]
["Praha 3 - Na Vackově",null,null,null,null,"X"]
["Praha 3 - Rezidence Vitkovia",null,null,null,null,"X"]
["Praha 3 - Štítného",null,null,null,null,"X"]
["Praha 4 - Antal",null,null,null,null,"X"]
["Praha 4 - Baarova",null,null,null,null,"X"]
["Praha 4 - Bartoškova_Liberty Building",null,null,null,null,"X"]
["Praha 4 - Citadela Nové Dvory",null,null,null,null,"X"]
["Praha 4 - Jitřní (Hyacint)",null,null,null,null,"X"]
["Praha 4 - Milíčovský Háj - východ, jih",null,null,null,null,"X"]
["Praha 4 - MIlíčovský háj II",null,null,null,null,"X"]
["Praha 4 - Modřanský háj",null,null,null,null,"X"]
["Praha 4 - Na Dolinách",null,null,null,null,"X"]
["Praha 4 - Na Líše",null,null,null,null,"X"]
["Praha 4 - Nad Ryšánkou",null,null,null,null,"X"]
["Praha 4 - nám.bří. Synků",null,null,null,null,"X"]
["Praha 4 - Procházkova",null,null,null,null,"X"]
["Praha 4 - Reitknechtka",null,null,null,null,"X"]
["Praha 4 - Rezidence Gröbovka",null,null,null,null,"X"]
["Praha 4 - Steinerova",null,null,null,null,"X"]
["Praha 4 - Tyršův vrch",null,null,null,null,"X"]
["Praha 4 - U Dubu I.etapa",null,null,null,null,"X"]
["Praha 4 - U Hamerského rybníka",null,null,null,null,"X"]
["Praha 4 - U Michelského Mlýna",null,null,null,null,"X"]
["Praha 4 - Újezd u Průhonic",null,null,null,null,"X"]
["Praha 4 - Vokáčova",null,null,null,null,"X"]
["Praha 4 - Zdiměřická",null,null,null,null,"X"]
["Praha 5 - Britská čtvrť",null,null,null,null,"X"]
["Praha 5 - Devonská (Panorama Barrandov II)",null,null,null,null,"X"]
["Praha 5 - Devonská (SKY BARRANDOV)",null,null,null,null,"X"]
["Praha 5 - Holečkova ( Sacre Coeur II  SATPO )",null,null,null,null,"X"]
["Praha 5 - Jindřicha Plachty 595, 596",null,null,null,null,"X"]
["Praha 5 - Kaskády Barrandov IV",null,null,null,null,"X"]
["Praha 5 - Krásná Hůrka",null,null,null,null,"X"]
["Praha 5 - Na Farkáně (A-Trio)",null,null,null,null,"X"]
["Praha 5 - Na Hvězdárně",null,null,null,null,"X"]
["Praha 5 - Na Radosti",null,null,null,null,"X"]
["Praha 5 - Naskové",null,null,null,null,"X"]
["Praha 5 - Petržílkova-Na Zlatě (Smart 2 - Trigema)",null,null,null,null,"X"]
["Praha 5 - Pod Ateliéry",null,null,null,null,"X"]
["Praha 5 - Rezidence Hřebenky",null,null,null,null,"X"]
["Praha 5 - Rezidence Waltrowka",null,null,null,null,"X"]
["Praha 5 - Skalní - Rezidence Barrandovská Skála",null,null,null,null,"X"]
["Praha 5 - U Dívčích Hradů Vila Děvín",null,null,null,null,"X"]
["Praha 5 - V Zářezu (Jinonická vyhlídka)",null,null,null,null,"X"]
["Praha 5 - Výhledová (Viladomy Žvahov)",null,null,null,null,{"$f":"IF(nem_TypDP=DP_Byty,DP_Byty_Seznam,IF(nem_TypDP=DP_Pozemky,DP_Pozemky_Seznam,IF(nem_TypDP=DP_RodinneDomy,DP_RodinneDomy,\"X\")))","v":"X"}]
["Praha 5 - Zdíkovská (BM SPiritka)",null,null,null,null,"X"]
["Praha 6 - Jednořádá - Byty Bubeneč",null,null,null,null,"X"]
["Praha 6 - Lysolajské údolí",null,null,null,null,"X"]
["Praha 6 - Nad Závěrkou",null,null,null,null,"X"]
["Praha 6 - Pod Novým Lesem čp.163",null,null,null,null,"X"]
["Praha 6 - Radimova - City Star",null,null,null,null,"X"]
["Praha 6 - Radimova 622_38",null,null,null,null,"X"]
["Praha 6 - Radimova 622_38 aktualizace",null,null,null,null,"X"]
["Praha 6 - Skokanská - Rezidence LA CRONE",null,null,null,null,"X"]
["Praha 6 - Střešovická_Patočkova - Triangle",null,null,null,null,"X"]
["Praha 6 - Vila Verde",null,null,null,null,"X"]
["Praha 7 - Green House Bridge",null,null,null,null,"X"]
["Praha 7 - Holešovický pivovar BD C",null,null,null,null,"X"]
["Praha 7 - Jubileum",null,null,null,null,"X"]
["Praha 7 - Korunovační 704-14",null,null,null,null,"X"]
["Praha 7 - Ovenecká Bubenečský vrch",null,null,null,null,"X"]
["Praha 7 - U Studánky 18",null,null,null,null,"X"]
["Praha 8 - Anglický Dvůr",null,null,null,null,"X"]
["Praha 8 - Atrium Kobylisy (Kobylisy II)",null,null,null,null,"X"]
["Praha 8 - Bytový park Prosek III (Finep)",null,null,null,null,"X"]
["Praha 8 - Karlínské dvory",null,null,null,null,"X"]
["Praha 8 - Libeňské doky",null,null,null,null,"X"]
["Praha 8 - Na Dědince 818",null,null,null,null,"X"]
["Praha 8 - Nad Rokoskou",null,null,null,null,"X"]
["Praha 8 - Pod Vodárenskou věží - Davídkova",null,null,null,null,"X"]
["Praha 8 - rezidence Eliška (Freyova)",null,null,null,null,"X"]
["Praha 8 - rezidence Střížkov (Teplická ul.)",null,null,null,null,"X"]
["Praha 8 - Střížkov , ul. Střelničná - byty SMO",null,null,null,null,"X"]
["Praha 8 - U Libeňského pivovaru - X-Lofts",null,null,null,null,"X"]
["Praha 8 - V Mezihoří",null,null,null,null,"X"]
["Praha 8- Nové Chabry -bytový objekt A",null,null,null,null,"X"]
["Praha 8- Nové Chabry -bytový objekt B",null,null,null,null,"X"]
["Praha 8- Vánková (Čámovka)",null,null,null,null,"X"]
["Praha 9 - Bytový park Prosek I",null,null,null,null,"X"]
["Praha 9 - Čakovický park G, H",null,null,null,null,"X"]
["Praha 9 - Černý Most - Ocelkova",null,null,null,null,"X"]
["Praha 9 - Jahodnice",null,null,null,null,"X"]
["Praha 9 - Kbely - Luštěnická",null,null,null,null,"X"]
["Praha 9 - Kejřův Mlýn",null,null,null,null,"X"]
["Praha 9 - Kejřův Park",null,null,null,null,"X"]
["Praha 9 - Kytlická Kbely - Skanska",null,null,null,null,"X"]
["Praha 9 - Nová Harfa III",null,null,null,null,"X"]
["Praha 9 - Nová Harfa K, L, M",null,null,null,null,"X"]
["Praha 9 - Praha 9 - Azalea",null,null,null,null,"X"]
["Praha 9 - Rezidence Klánovice",null,null,null,null,"X"]
["Praha 9 - Rezidence nad Rokytkou",null,null,null,null,"X"]
["Praha 9 - Rezidence Tupolevova II",null,null,null,null,"X"]
["Praha 9 - Rezidence Veselská",null,null,null,null,"X"]
["Praha 9 - U Proseckého kostela",null,null,null,null,"X"]
["Praha 9 - Újezd nad Lesy",null,null,null,null,"X"]
["Praha 9 - Viva rezidence",null,null,null,null,"X"]
["Praha 9 - Zelené Město",null,null,null,null,"X"]
["Praha 9 - Zlatá Harfa",null,null,null,null,"X"]
["Praha 10 - Aurora",null,null,null,null,"X"]
["Praha 10 - Bydlení nad Přehradou II",null,null,null,null,"X"]
["Praha 10 - Bytový komplex Hostivař",null,null,null,null,"X"]
["Praha 10 - Byty Malešice I.etapa - Počernická ul",null,null,null,null,"X"]
["Praha 10 - Byty U Roháčových kasáren x Novorossijská",null,null,null,null,"X"]
["Praha 10 - Kaskády u Botiče - Práčská",null,null,null,null,"X"]
["Praha 10 - Kaskády u Botiče II. etapa Harlacherova (Zelený Botič)",null,null,null,null,"X"]
["Praha 10 - Kompex bytových domů v Kytínské",null,null,null,null,"X"]
["Praha 10 - Malý Háj - Štěrboholy  (budova E)",null,null,null,null,"X"]
["Praha 10 - Malý Háj - Štěrboholy (budova A-B)",null,null,null,null,"X"]
["Praha 10 - Malý Háj - Štěrboholy (budova C)",null,null,null,null,{"$f":"IF(nem_TypDP=DP_Byty,DP_Byty_Seznam,IF(nem_TypDP=DP_Pozemky,DP_Pozemky_Seznam,IF(nem_TypDP=DP_RodinneDomy,DP_RodinneDomy,\"X\")))","v":"X"}]
["Praha 10 - Malý Háj - Štěrboholy etapa C1+C2",null,null,null,null,"X"]
["Praha 10 - obytný soubor Bohdalec (Geosan)",null,null,null,null,"X"]
["Praha 10 - Sluneční vršek III. fáze 1",null,null,null,null,"X"]
["Praha - Uhříněves",null,null,null,null,"X"]
["Přezletice - Zlatý kopec",null,null,null,null,"X"]
["Příbram",null,null,null,null,"X"]
["Rosice - Palackého nám",null,null,null,null,"X"]
["Říčany - Říčany",null,null,null,null,"X"]
["Řitka - DP Štěpnice",null,null,null,null,"X"]
["Slaný - Kybalova",null,null,null,null,"X"]
["Slavkov u Brna - Kaláb - rezidence Austerlitz",null,null,null,null,"X"]
["Starý Plzenec - DP - Slunný vrch",null,null,null,null,"X"]
["Trebon - Dukelska",null,null,null,null,"X"]
["Trnová - ROSA CANINA",null,null,null,null,"X"]
["Třinec - Lyžbice",null,null,null,null,"X"]
["Úvaly - Hostín development s.r.o",null,null,null,null,"X"]
["Veltrusy",null,null,null,null,"X"]
["Zlín",null,null,null,null,"X"]

{"sheet":"Old_New","index":24,"n_rows":0,"n_cols":0,"rows_kept":0,"cut":false,"hidden":true,"merged":[]}